{"text_format":"1","workbook":"xlsx","n_sheets":3,"sheets":["Search engine"," Flight data base","airport codes"],"not_rendered":{"charts":0,"images":1,"macros":1,"external_links":0,"defined_names":5,"comments":0,"pivot_tables":0},"unopened":[],"bounds":{"document_bytes":16777216,"sheet_cells":100000,"rows_first":2000,"rows_last":500,"rows_between":2000,"halvings":0,"cell_chars":16384,"cell_head_chars":4096},"cells_cut":0,"cells_raw":0,"read":"whole","date_system":"1900"}

{"sheet":"Search engine","index":0,"n_rows":41,"n_cols":18,"rows_kept":41,"cut":false,"hidden":false,"merged":[[7,1,7,7],[7,11,7,16],[13,1,13,17],[12,1,12,17]]}
[]
[]
[]
[]
[]
[]
[]
[null,"INSTRUCTIONS: FILL OUT ONE OR MORE FIELDS AND PRESS  SEARCH FLIGHTS                              INSTRUCTIONS: REMPLIR UN OU PLUSIEURS CHAMPS ET APUYER SUR LE BUTTON DE RECHERCHE DE VOLS \"SEARCH FLIGHTS\"",null,null,null,null,null,null,null,null,null,"X WILL MARK THE DAY OF THE WEEK WHERE THE FLIGHT WILL TAKE PLACE                    X MARQUERA LE JOUR DE LA SEMAINE OERE LE VOL AURA LIEU"]
[null,"Airline/Compagnie Aériénne","Flight number/Numéro de vol","Origin Airport Code/ Code de l'Aéroport Origine","Country Origin/ Pays d'Origine","Destination Airport Code/ Code de l'Aéroport de Destination","Country Destination/Pays de Destination","Available from date / Disponible à partir de","Estimated Time of Departure / Estimation de l'heure de depart","Avalable till date / Disponible jusque à","Estimated Time of Arrival / Estimation de l'heure d'arrivée","MONDAY/ LUNDI","TUESDAY/ MARDI","WEDNESDAY/MERCREDI","THURSDAY/ JEUDI ","FRIDAY/ VENDREDI","SATURDAY / SAMEDI","SUNDAY / DIMANCHE"]
[]
[]
[]
[null,"PLEASE CONTACT THE AIRLINE IN ORDER TO CONFIRM FLIGHT AND CHECK AVAILABILITY  Source of data base: LUFTHANSA, AIR FRANCE-KLM, EMIRATES, QATAR AIRWAYS, TURKISH AIRLINES, ETIHAD, FLIGHT RADAR "]
[null,"VEUILLEZ CONTACTER LA COMPAGNIE AÉRIENNE POUR CONFIRMER LE VOL ET VÉRIFIER LA DISPONIBILITÉ Source de la base de données: LUFTHANSA, AIR FRANCE-KLM, EMIRATES, QATAR AIRWAYS, TURKISH AIRLINES, ETIHAD, FLIGHT RADAR "]
[null,"Airline/Compagnie Aériénne","Flight number/Numéro de vol","Origin Airport Code/ Code de l'Aéroport Origine","Country Origin/ Pays d'Origine","Destination Airport Code/ Code de l'Aéroport de Destination","Country Destination/Pays de Destination","Available from date / Disponible à partir de","Estimated Time of Departure / Estimation de l'heure de depart","Avalable till date / Disponible jusque à","Estimated Time of Arrival / Estimation de l'heure d'arrivée","MONDAY/ LUNDI","TUESDAY/ MARDI","WEDNESDAY/MERCREDI","THURSDAY/ JEUDI ","FRIDAY/ VENDREDI","SATURDAY / SAMEDI","SUNDAY / DIMANCHE"]
[null,"AIR FRANCE","AF 0914","ACC","Ghana","CDG","France","2020-12-14",null,"2021-01-03",null,"X",null,null,null,null,"X"]
[null,"AIR FRANCE","AF 0584","ACC","Ghana","CDG","France","2020-12-14",null,"2021-01-03",null,null,"X",null,"X",null,null,"X"]
[null,"AIR FRANCE","AF6728","ACC","Ghana","CDG","France","2020-12-14",null,"2021-01-03",null,null,null,"X",null,"X"]
[null,"KLM","KL 0589","ACC","Ghana","AMS","Netherlands","2020-12-14",null,"2021-01-03",null,"X","X","X","X","X",null,"X"]
[null,"WARA AIR SERVICE EUROPE","SWT551","ACC","Ghana","OUA","Burkina Faso","2020-12-18",null,"2020-12-18",null,null,null,null,null,"X"]
[null,"Brussels Airlines","SN291","ACC","Ghana","ABJ","Cote d'Ivoire","24DEC20",2145,"26DEC20",2250,null,null,null,"X",null,"X"]
[null,"Brussels Airlines","SN291","ACC","Ghana","BRU","Belgium","24DEC20",2145,"26DEC20",740,null,null,null,"X",null,"X"]
[null,"Brussels Airlines","SN291","ACC","Ghana","ABJ","Cote d'Ivoire","31DEC20",2145,"31DEC20",2250,null,null,null,"X"]
[null,"Brussels Airlines","SN291","ACC","Ghana","BRU","Belgium","31DEC20",2145,"31DEC20",740,null,null,null,"X"]
[null,"Brussels Airlines","SN291","ACC","Ghana","ABJ","Cote d'Ivoire","2021-01-02",2145,"2021-01-02",2250,null,null,null,null,null,"X"]
[null,"Brussels Airlines","SN291","ACC","Ghana","BRU","Belgium","2021-01-02",2145,"2021-01-02",740,null,null,null,null,null,"X"]
[null,"Brussels Airlines","SN291","ACC","Ghana","ABJ","Cote d'Ivoire","2021-01-04",2145,"2021-01-04",2250,"X"]
[null,"Brussels Airlines","SN291","ACC","Ghana","BRU","Belgium","2021-01-04",2145,"2021-01-04",740,"X"]
[null,"Brussels Airlines","SN291","ACC","Ghana","ABJ","Cote d'Ivoire","2021-01-07",2145,"2021-01-14",2250,"X",null,null,"X",null,"X"]
[null,"Brussels Airlines","SN291","ACC","Ghana","BRU","Belgium","2021-01-07",2145,"2021-01-14",740,"X",null,null,"X",null,"X"]
[null,"Brussels Airlines","SN291","ACC","Ghana","ABJ","Cote d'Ivoire","17DEC20",2145,"17DEC20",2250,null,null,null,"X"]
[null,"Brussels Airlines","SN291","ACC","Ghana","BRU","Belgium","17DEC20",2145,"17DEC20",740,null,null,null,"X"]
[null,"Brussels Airlines","SN291","ACC","Ghana","ABJ","Cote d'Ivoire","19DEC20",2145,"19DEC20",2250,null,null,null,null,null,"X"]
[null,"Brussels Airlines","SN291","ACC","Ghana","BRU","Belgium","19DEC20",2145,"19DEC20",740,null,null,null,null,null,"X"]
[null,"Brussels Airlines","SN291","ACC","Ghana","ABJ","Cote d'Ivoire","21DEC20",2145,"21DEC20",2250,"X"]
[null,"Brussels Airlines","SN291","ACC","Ghana","BRU","Belgium","21DEC20",2145,"21DEC20",740,"X"]
[null,"Brussels Airlines","SN291","ACC","Ghana","ABJ","Cote d'Ivoire","28DEC20",2145,"28DEC20",2250,"X"]
[null,"Brussels Airlines","SN291","ACC","Ghana","BRU","Belgium","28DEC20",2145,"28DEC20",740,"X"]
[null,"EMIRATES","EK 0787","ACC","Ghana","ABJ","Cote d'Ivoire","2020-12-09","1130","2020-12-31","1235",null,null,"X",null,"X",null,"X"]
[null,"TURKISH AIRWAYS",null,"ACC","Ghana","IST","Turkey","2020-12-01",null,"2020-12-31",null,null,"X",null,null,"X"]
{"$rows_left_out":2}
{"sheet":" Flight data base","index":1,"n_rows":1162,"n_cols":19,"rows_kept":1162,"cut":false,"hidden":false,"merged":[]}
[null,"Airline/Compagnie Aériénne","Flight number/Numéro de vol","Origin Airport Code/ Code de l'Aéroport Origine","Country Origin/ Pays d'Origine","Destination Airport Code/ Code de l'Aéroport de Destination","Country Destination/Pays de Destination","Available from date / Disponible à partir de","Estimated Time of Departure / Estimation de l'heure de depart","Estimated Time of Arrival / Estimation de l'heure d'arrivée","Avalable till date / Disponible jusque à","MONDAY/ LUNDI","TUESDAY/ MARDI","WEDNESDAY/MERCREDI","THURSDAY/ JEUDI ","FRIDAY/ VENDREDI","SATURDAY / SAMEDI","SUNDAY / DIMANCHE","Fligh type PF passenger freighter (PF) full freighter (FF)/ CARGO SUR AVION PASSAGER PF - AVION CARGO FF"]
[1,"AIR FRANCE","AF0702","ABJ",{"$f":"_xlfn.XLOOKUP(' Flight data base'!D2,'airport codes'!$D$3:$D$2103,'airport codes'!$C$3:$C$2103)","v":"Cote d'Ivoire"},"CDG",{"$f":"_xlfn.XLOOKUP(' Flight data base'!F2,'airport codes'!$D$3:$D$2103,'airport codes'!$C$3:$C$2103)","v":"France"},"2020-12-14",null,null,"2021-01-03","X","X","X","X","X","X","X","PF"]
[2,"AIR FRANCE","AF0148","ABV",{"$f":"_xlfn.XLOOKUP(' Flight data base'!D3,'airport codes'!$D$3:$D$2103,'airport codes'!$C$3:$C$2103)","v":"Nigeria"},"CDG",{"$f":"_xlfn.XLOOKUP(' Flight data base'!F3,'airport codes'!$D$3:$D$2103,'airport codes'!$C$3:$C$2103)","v":"France"},"2020-12-14",null,null,"2021-01-03",null,null,"X",null,null,null,"X","PF"]
[3,"AIR FRANCE","AF 0914","ACC",{"$f":"_xlfn.XLOOKUP(' Flight data base'!D4,'airport codes'!$D$3:$D$2103,'airport codes'!$C$3:$C$2103)","v":"Ghana"},"CDG",{"$f":"_xlfn.XLOOKUP(' Flight data base'!F4,'airport codes'!$D$3:$D$2103,'airport codes'!$C$3:$C$2103)","v":"France"},"2020-12-14",null,null,"2021-01-03","X",null,null,null,null,"X",null,"PF"]
[4,"AIR FRANCE","AF 0584","ACC",{"$f":"_xlfn.XLOOKUP(' Flight data base'!D5,'airport codes'!$D$3:$D$2103,'airport codes'!$C$3:$C$2103)","v":"Ghana"},"CDG",{"$f":"_xlfn.XLOOKUP(' Flight data base'!F5,'airport codes'!$D$3:$D$2103,'airport codes'!$C$3:$C$2103)","v":"France"},"2020-12-14",null,null,"2021-01-03",null,"X",null,"X",null,null,"X","PF"]
[5,"AIR FRANCE","AF6728","ACC",{"$f":"_xlfn.XLOOKUP(' Flight data base'!D6,'airport codes'!$D$3:$D$2103,'airport codes'!$C$3:$C$2103)","v":"Ghana"},"CDG",{"$f":"_xlfn.XLOOKUP(' Flight data base'!F6,'airport codes'!$D$3:$D$2103,'airport codes'!$C$3:$C$2103)","v":"France"},"2020-12-14",null,null,"2021-01-03",null,null,"X",null,"X",null,null,"PF"]
[6,"KLM","KL 0589","ACC",{"$f":"_xlfn.XLOOKUP(' Flight data base'!D7,'airport codes'!$D$3:$D$2103,'airport codes'!$C$3:$C$2103)","v":"Ghana"},"AMS",{"$f":"_xlfn.XLOOKUP(' Flight data base'!F7,'airport codes'!$D$3:$D$2103,'airport codes'!$C$3:$C$2103)","v":"Netherlands"},"2020-12-14",null,null,"2021-01-03","X","X","X","X","X",null,"X","PF"]
[7,"KLM","KL 0765","AUA",{"$f":"_xlfn.XLOOKUP(' Flight data base'!D8,'airport codes'!$D$3:$D$2103,'airport codes'!$C$3:$C$2103)","v":"Aruba"},"AMS",{"$f":"_xlfn.XLOOKUP(' Flight data base'!F8,'airport codes'!$D$3:$D$2103,'airport codes'!$C$3:$C$2103)","v":"Netherlands"},"2020-12-28",null,null,"2021-01-03",null,null,null,null,null,"X",null,"PF"]
[8,"KLM","KL 0767","AUA",{"$f":"_xlfn.XLOOKUP(' Flight data base'!D9,'airport codes'!$D$3:$D$2103,'airport codes'!$C$3:$C$2103)","v":"Aruba"},"AMS",{"$f":"_xlfn.XLOOKUP(' Flight data base'!F9,'airport codes'!$D$3:$D$2103,'airport codes'!$C$3:$C$2103)","v":"Netherlands"},"2020-12-28",null,null,"2021-01-03",null,null,null,null,"X",null,"X","PF"]
[9,"KLM","KL 0771","AUA",{"$f":"_xlfn.XLOOKUP(' Flight data base'!D10,'airport codes'!$D$3:$D$2103,'airport codes'!$C$3:$C$2103)","v":"Aruba"},"AMS",{"$f":"_xlfn.XLOOKUP(' Flight data base'!F10,'airport codes'!$D$3:$D$2103,'airport codes'!$C$3:$C$2103)","v":"Netherlands"},"2020-12-14",null,null,"2021-01-03","X",null,"X",null,null,"X",null,"PF"]
[10,"KLM","KL 0773","AUA",{"$f":"_xlfn.XLOOKUP(' Flight data base'!D11,'airport codes'!$D$3:$D$2103,'airport codes'!$C$3:$C$2103)","v":"Aruba"},"AMS",{"$f":"_xlfn.XLOOKUP(' Flight data base'!F11,'airport codes'!$D$3:$D$2103,'airport codes'!$C$3:$C$2103)","v":"Netherlands"},"2020-12-14",null,null,"2021-01-03",null,null,null,"X",null,null,"X","PF"]
[11,"KLM","KL0779","AUA",{"$f":"_xlfn.XLOOKUP(' Flight data base'!D12,'airport codes'!$D$3:$D$2103,'airport codes'!$C$3:$C$2103)","v":"Aruba"},"AMS",{"$f":"_xlfn.XLOOKUP(' Flight data base'!F12,'airport codes'!$D$3:$D$2103,'airport codes'!$C$3:$C$2103)","v":"Netherlands"},"2020-12-14",null,null,"2021-01-03",null,"X",null,null,"X",null,null,"PF"]
[12,"AIR FRANCE","AF0775","BGF",{"$f":"_xlfn.XLOOKUP(' Flight data base'!D13,'airport codes'!$D$3:$D$2103,'airport codes'!$C$3:$C$2103)","v":"Central African Republic"},"CDG",{"$f":"_xlfn.XLOOKUP(' Flight data base'!F13,'airport codes'!$D$3:$D$2103,'airport codes'!$C$3:$C$2103)","v":"France"},"2020-12-14",null,null,"2021-01-03",null,"X",null,null,null,null,null,"PF"]
[13,"AIR FRANCE","AF0878","BGF",{"$f":"_xlfn.XLOOKUP(' Flight data base'!D14,'airport codes'!$D$3:$D$2103,'airport codes'!$C$3:$C$2103)","v":"Central African Republic"},"CDG",{"$f":"_xlfn.XLOOKUP(' Flight data base'!F14,'airport codes'!$D$3:$D$2103,'airport codes'!$C$3:$C$2103)","v":"France"},"2020-12-14",null,null,"2021-01-03",null,null,null,null,null,"X",null,"PF"]
[14,"AIR FRANCE","AF0530","BKO",{"$f":"_xlfn.XLOOKUP(' Flight data base'!D15,'airport codes'!$D$3:$D$2103,'airport codes'!$C$3:$C$2103)","v":"Mali"},"CDG",{"$f":"_xlfn.XLOOKUP(' Flight data base'!F15,'airport codes'!$D$3:$D$2103,'airport codes'!$C$3:$C$2103)","v":"France"},"2020-12-14",null,null,"2021-01-03","X","X","X","X","X","X","X","PF"]
[15,"AIR FRANCE","AF6747","BKO",{"$f":"_xlfn.XLOOKUP(' Flight data base'!D16,'airport codes'!$D$3:$D$2103,'airport codes'!$C$3:$C$2103)","v":"Mali"},"CDG",{"$f":"_xlfn.XLOOKUP(' Flight data base'!F16,'airport codes'!$D$3:$D$2103,'airport codes'!$C$3:$C$2103)","v":"France"},"2020-12-14",null,null,"2021-01-03",null,null,null,null,"X",null,null,"PF"]
[16,"KLM","KL 0765","BON",{"$f":"_xlfn.XLOOKUP(' Flight data base'!D17,'airport codes'!$D$3:$D$2103,'airport codes'!$C$3:$C$2103)","v":"Netherlands Antilles"},"AMS",{"$f":"_xlfn.XLOOKUP(' Flight data base'!F17,'airport codes'!$D$3:$D$2103,'airport codes'!$C$3:$C$2103)","v":"Netherlands"},"2020-12-28",null,null,"2021-01-03",null,null,null,null,null,"X",null,"PF"]
[17,"KLM","KL 0767","BON",{"$f":"_xlfn.XLOOKUP(' Flight data base'!D18,'airport codes'!$D$3:$D$2103,'airport codes'!$C$3:$C$2103)","v":"Netherlands Antilles"},"AMS",{"$f":"_xlfn.XLOOKUP(' Flight data base'!F18,'airport codes'!$D$3:$D$2103,'airport codes'!$C$3:$C$2103)","v":"Netherlands"},"2020-12-28",null,null,"2021-01-03",null,null,null,null,"X",null,"X","PF"]
[18,"KLM","KL 0771","BON",{"$f":"_xlfn.XLOOKUP(' Flight data base'!D19,'airport codes'!$D$3:$D$2103,'airport codes'!$C$3:$C$2103)","v":"Netherlands Antilles"},"AMS",{"$f":"_xlfn.XLOOKUP(' Flight data base'!F19,'airport codes'!$D$3:$D$2103,'airport codes'!$C$3:$C$2103)","v":"Netherlands"},"2020-12-14",null,null,"2021-01-03","X",null,"X",null,null,"X",null,"PF"]
[19,"KLM","KL 0773","BON",{"$f":"_xlfn.XLOOKUP(' Flight data base'!D20,'airport codes'!$D$3:$D$2103,'airport codes'!$C$3:$C$2103)","v":"Netherlands Antilles"},"AMS",{"$f":"_xlfn.XLOOKUP(' Flight data base'!F20,'airport codes'!$D$3:$D$2103,'airport codes'!$C$3:$C$2103)","v":"Netherlands"},"2020-12-14",null,null,"2021-01-03",null,null,null,"X",null,null,"X","PF"]
[20,"KLM","KL0779","BON",{"$f":"_xlfn.XLOOKUP(' Flight data base'!D21,'airport codes'!$D$3:$D$2103,'airport codes'!$C$3:$C$2103)","v":"Netherlands Antilles"},"AMS",{"$f":"_xlfn.XLOOKUP(' Flight data base'!F21,'airport codes'!$D$3:$D$2103,'airport codes'!$C$3:$C$2103)","v":"Netherlands"},"2020-12-14",null,null,"2021-01-03",null,"X",null,null,"X",null,null,"PF"]
[21,"AIR FRANCE","AF 0736","BZV",{"$f":"_xlfn.XLOOKUP(' Flight data base'!D22,'airport codes'!$D$3:$D$2103,'airport codes'!$C$3:$C$2103)","v":"Congo (ROC)"},"CDG",{"$f":"_xlfn.XLOOKUP(' Flight data base'!F22,'airport codes'!$D$3:$D$2103,'airport codes'!$C$3:$C$2103)","v":"France"},"2020-12-14",null,null,"2021-01-03",null,null,null,null,"X",null,"X","PF"]
[22,"AIR FRANCE","AF 0722","BZV",{"$f":"_xlfn.XLOOKUP(' Flight data base'!D23,'airport codes'!$D$3:$D$2103,'airport codes'!$C$3:$C$2103)","v":"Congo (ROC)"},"CDG",{"$f":"_xlfn.XLOOKUP(' Flight data base'!F23,'airport codes'!$D$3:$D$2103,'airport codes'!$C$3:$C$2103)","v":"France"},"2020-12-14",null,null,"2020-12-27",null,"X",null,"X",null,"X",null,"PF"]
[23,"AIR FRANCE","AF 0722","BZV",{"$f":"_xlfn.XLOOKUP(' Flight data base'!D24,'airport codes'!$D$3:$D$2103,'airport codes'!$C$3:$C$2103)","v":"Congo (ROC)"},"CDG",{"$f":"_xlfn.XLOOKUP(' Flight data base'!F24,'airport codes'!$D$3:$D$2103,'airport codes'!$C$3:$C$2103)","v":"France"},"2020-12-28",null,null,"2021-01-03",null,"X",null,null,null,"X",null,"PF"]
[24,"AIR FRANCE","AF0756","BZV",{"$f":"_xlfn.XLOOKUP(' Flight data base'!D25,'airport codes'!$D$3:$D$2103,'airport codes'!$C$3:$C$2103)","v":"Congo (ROC)"},"CDG",{"$f":"_xlfn.XLOOKUP(' Flight data base'!F25,'airport codes'!$D$3:$D$2103,'airport codes'!$C$3:$C$2103)","v":"France"},"2020-12-14",null,null,"2021-01-03","X",null,null,null,null,null,null,"PF"]
[25,"AIR FRANCE","AF 0852","CAY",{"$f":"_xlfn.XLOOKUP(' Flight data base'!D26,'airport codes'!$D$3:$D$2103,'airport codes'!$C$3:$C$2103)","v":"French Guiana"},"CDG",{"$f":"_xlfn.XLOOKUP(' Flight data base'!F26,'airport codes'!$D$3:$D$2103,'airport codes'!$C$3:$C$2103)","v":"France"},"2020-12-14",null,null,"2021-01-03","X","X","X","X","X","X","X","PF"]
[26,"AIR FRANCE","AF0724","CKY",{"$f":"_xlfn.XLOOKUP(' Flight data base'!D27,'airport codes'!$D$3:$D$2103,'airport codes'!$C$3:$C$2103)","v":"Guinea"},"CDG",{"$f":"_xlfn.XLOOKUP(' Flight data base'!F27,'airport codes'!$D$3:$D$2103,'airport codes'!$C$3:$C$2103)","v":"France"},"2020-12-14",null,null,"2021-01-03",null,null,"X",null,"X",null,null,"PF"]
[27,"AIR FRANCE","AF0596","CKY",{"$f":"_xlfn.XLOOKUP(' Flight data base'!D28,'airport codes'!$D$3:$D$2103,'airport codes'!$C$3:$C$2103)","v":"Guinea"},"CDG",{"$f":"_xlfn.XLOOKUP(' Flight data base'!F28,'airport codes'!$D$3:$D$2103,'airport codes'!$C$3:$C$2103)","v":"France"},"2020-12-14",null,null,"2021-01-03",null,"X",null,"X",null,"X",null,"PF"]
[28,"AIR FRANCE","AF0727","CKY",{"$f":"_xlfn.XLOOKUP(' Flight data base'!D29,'airport codes'!$D$3:$D$2103,'airport codes'!$C$3:$C$2103)","v":"Guinea"},"CDG",{"$f":"_xlfn.XLOOKUP(' Flight data base'!F29,'airport codes'!$D$3:$D$2103,'airport codes'!$C$3:$C$2103)","v":"France"},"2020-12-14",null,null,"2021-01-03","X",null,null,null,null,null,null,"PF"]
[29,"AIR FRANCE","AF0751","CKY",{"$f":"_xlfn.XLOOKUP(' Flight data base'!D30,'airport codes'!$D$3:$D$2103,'airport codes'!$C$3:$C$2103)","v":"Guinea"},"CDG",{"$f":"_xlfn.XLOOKUP(' Flight data base'!F30,'airport codes'!$D$3:$D$2103,'airport codes'!$C$3:$C$2103)","v":"France"},"2020-12-14",null,null,"2021-01-03",null,null,null,null,null,null,"X","PF"]
[30,"AIR FRANCE","AF6747","CMN",{"$f":"_xlfn.XLOOKUP(' Flight data base'!D31,'airport codes'!$D$3:$D$2103,'airport codes'!$C$3:$C$2103)","v":"Morocco"},"CDG",{"$f":"_xlfn.XLOOKUP(' Flight data base'!F31,'airport codes'!$D$3:$D$2103,'airport codes'!$C$3:$C$2103)","v":"France"},"2020-12-14",null,null,"2021-01-03",null,null,null,null,"X",null,null,"PF"]
[31,"AIR FRANCE","AF804","COO",{"$f":"_xlfn.XLOOKUP(' Flight data base'!D32,'airport codes'!$D$3:$D$2103,'airport codes'!$C$3:$C$2103)","v":"Benin"},"CDG",{"$f":"_xlfn.XLOOKUP(' Flight data base'!F32,'airport codes'!$D$3:$D$2103,'airport codes'!$C$3:$C$2103)","v":"France"},"2020-12-14",null,null,"2021-01-03","X",null,"X",null,"X",null,"X","PF"]
[32,"KLM","KL0597","CPT",{"$f":"_xlfn.XLOOKUP(' Flight data base'!D33,'airport codes'!$D$3:$D$2103,'airport codes'!$C$3:$C$2103)","v":"South Africa"},"AMS",{"$f":"_xlfn.XLOOKUP(' Flight data base'!F33,'airport codes'!$D$3:$D$2103,'airport codes'!$C$3:$C$2103)","v":"Netherlands"},"2020-12-07",null,null,"2021-01-03",null,"X","X","X","X","X","X","PF"]
[33,"KLM","KL0735","CUR",{"$f":"_xlfn.XLOOKUP(' Flight data base'!D34,'airport codes'!$D$3:$D$2103,'airport codes'!$C$3:$C$2103)","v":"Netherlands Antilles"},"AMS",{"$f":"_xlfn.XLOOKUP(' Flight data base'!F34,'airport codes'!$D$3:$D$2103,'airport codes'!$C$3:$C$2103)","v":"Netherlands"},"2020-12-14",null,null,"2021-01-03","X","X","X","X","X","X","X","PF"]
[34,"KLM","KL0515","DAR",{"$f":"_xlfn.XLOOKUP(' Flight data base'!D35,'airport codes'!$D$3:$D$2103,'airport codes'!$C$3:$C$2103)","v":"Tanzania"},"AMS",{"$f":"_xlfn.XLOOKUP(' Flight data base'!F35,'airport codes'!$D$3:$D$2103,'airport codes'!$C$3:$C$2103)","v":"Netherlands"},"2020-12-07",null,null,"2021-01-03",null,null,null,"X",null,null,"X","PF"]
[35,"KLM","KL0569","DAR",{"$f":"_xlfn.XLOOKUP(' Flight data base'!D36,'airport codes'!$D$3:$D$2103,'airport codes'!$C$3:$C$2103)","v":"Tanzania"},"AMS",{"$f":"_xlfn.XLOOKUP(' Flight data base'!F36,'airport codes'!$D$3:$D$2103,'airport codes'!$C$3:$C$2103)","v":"Netherlands"},"2020-12-07",null,null,"2021-01-03",null,null,"X",null,null,"X",null,"PF"]
[36,"KLM","KL0571","DAR",{"$f":"_xlfn.XLOOKUP(' Flight data base'!D37,'airport codes'!$D$3:$D$2103,'airport codes'!$C$3:$C$2103)","v":"Tanzania"},"AMS",{"$f":"_xlfn.XLOOKUP(' Flight data base'!F37,'airport codes'!$D$3:$D$2103,'airport codes'!$C$3:$C$2103)","v":"Netherlands"},"2020-12-07",null,null,"2021-01-03",null,"X",null,null,null,null,null,"PF"]
[37,"KLM","KL0567","DAR",{"$f":"_xlfn.XLOOKUP(' Flight data base'!D38,'airport codes'!$D$3:$D$2103,'airport codes'!$C$3:$C$2103)","v":"Tanzania"},"AMS",{"$f":"_xlfn.XLOOKUP(' Flight data base'!F38,'airport codes'!$D$3:$D$2103,'airport codes'!$C$3:$C$2103)","v":"Netherlands"},"2020-12-07",null,null,"2021-01-03",null,null,null,null,"X",null,null,"PF"]
[38,"AIR FRANCE","AF 0982","DLA",{"$f":"_xlfn.XLOOKUP(' Flight data base'!D39,'airport codes'!$D$3:$D$2103,'airport codes'!$C$3:$C$2103)","v":"Cameroon"},"CDG",{"$f":"_xlfn.XLOOKUP(' Flight data base'!F39,'airport codes'!$D$3:$D$2103,'airport codes'!$C$3:$C$2103)","v":"France"},"2020-12-14",null,null,"2021-01-03",null,null,null,"X",null,null,"X","PF"]
[39,"AIR FRANCE","AF6746","DLA",{"$f":"_xlfn.XLOOKUP(' Flight data base'!D40,'airport codes'!$D$3:$D$2103,'airport codes'!$C$3:$C$2103)","v":"Cameroon"},"CDG",{"$f":"_xlfn.XLOOKUP(' Flight data base'!F40,'airport codes'!$D$3:$D$2103,'airport codes'!$C$3:$C$2103)","v":"France"},"2020-12-14",null,null,"2021-01-03","X",null,null,null,null,null,null,"PF"]
{"$rows_left_out":1123}
{"sheet":"airport codes","index":2,"n_rows":2103,"n_cols":4,"rows_kept":2103,"cut":false,"hidden":false,"merged":[]}
[]
[null,"City/Airport","Country","IATA code"]
[null,"Aarhus","Denmark","AAR"]
[null,"Abadan","Iran","ABD"]
[null,"Abeche","Chad","AEH"]
[null,"Aberdeen","United Kingdom","ABZ"]
[null,"Aberdeen (SD)","USA","ABR"]
[null,"Abidjan","Cote d'Ivoire","ABJ"]
[null,"Abilene (TX)","USA","ABI"]
[null,"Abu Dhabi - Abu Dhabi International","United Arab Emirates","AUH"]
[null,"Abuja - Nnamdi Azikiwe International Airport","Nigeria","ABV"]
[null,"Abu Rudeis","Egypt","AUE"]
[null,"Abu Simbel","Egypt","ABS"]
[null,"Acapulco","Mexico","ACA"]
[null,"Accra - Kotoka International Airport","Ghana","ACC"]
[null,"Adana","Turkey","ADA"]
[null,"Addis Ababa - Bole International Airport","Ethiopia","ADD"]
[null,"Adelaide","Australia","ADL"]
[null,"Aden - Aden International Airport","Yemen","ADE"]
[null,"Adiyaman","Turkey","ADF"]
[null,"Adler/Sochi","Russia","AER"]
[null,"Agades","Niger","AJY"]
[null,"Agadir","Morocco","AGA"]
[null,"Agana (Hagåtña)","Guam","SUM"]
[null,"Aggeneys","South Africa","AGZ"]
[null,"Aguadilla","Puerto Rico","BQN"]
[null,"Aguascaliente","Mexico","AGU"]
[null,"Ahmedabad","India","AMD"]
[null,"Aiyura","Papua New Guinea","AYU"]
[null,"Ajaccio","France","AJA"]
[null,"Akita","Japan","AXT"]
[null,"Akron (OH)","USA","CAK"]
[null,"Akrotiri - RAF","Cyprus","AKT"]
[null,"Al Ain","United Arab Emirates","AAN"]
[null,"Al Arish","Egypt","AAC"]
[null,"Albany","Australia","ALH"]
[null,"Albany (GA)","USA","ABY"]
[null,"Albany (NY) - Albany International Airport","USA","ALB"]
[null,"Albi","France","LBI"]
[null,"Alborg","Denmark","AAL"]
{"$rows_left_out":2063}