{"text_format":"1","workbook":"xlsx","n_sheets":3,"sheets":["Search engine"," Flight data base","airport codes"],"not_rendered":{"charts":0,"images":1,"macros":1,"external_links":0,"defined_names":5,"comments":0,"pivot_tables":0},"unopened":[],"bounds":{"document_bytes":16777216,"sheet_cells":100000,"rows_first":2000,"rows_last":500,"rows_between":2000,"halvings":0,"cell_chars":16384,"cell_head_chars":4096},"cells_cut":0,"cells_raw":0,"read":"whole","date_system":"1900"}

{"sheet":"Search engine","index":0,"n_rows":41,"n_cols":18,"rows_kept":41,"cut":false,"hidden":false,"merged":[[7,1,7,7],[7,11,7,16],[13,1,13,17],[12,1,12,17]]}
[]
[]
[]
[]
[]
[]
[]
[null,"INSTRUCTIONS: FILL OUT ONE OR MORE FIELDS AND PRESS  SEARCH FLIGHTS                              INSTRUCTIONS: REMPLIR UN OU PLUSIEURS CHAMPS ET APUYER SUR LE BUTTON DE RECHERCHE DE VOLS \"SEARCH FLIGHTS\"",null,null,null,null,null,null,null,null,null,"X WILL MARK THE DAY OF THE WEEK WHERE THE FLIGHT WILL TAKE PLACE                    X MARQUERA LE JOUR DE LA SEMAINE OERE LE VOL AURA LIEU"]
[null,"Airline/Compagnie Aériénne","Flight number/Numéro de vol","Origin Airport Code/ Code de l'Aéroport Origine","Country Origin/ Pays d'Origine","Destination Airport Code/ Code de l'Aéroport de Destination","Country Destination/Pays de Destination","Available from date / Disponible à partir de","Estimated Time of Departure / Estimation de l'heure de depart","Avalable till date / Disponible jusque à","Estimated Time of Arrival / Estimation de l'heure d'arrivée","MONDAY/ LUNDI","TUESDAY/ MARDI","WEDNESDAY/MERCREDI","THURSDAY/ JEUDI ","FRIDAY/ VENDREDI","SATURDAY / SAMEDI","SUNDAY / DIMANCHE"]
[]
[]
[]
[null,"PLEASE CONTACT THE AIRLINE IN ORDER TO CONFIRM FLIGHT AND CHECK AVAILABILITY  Source of data base: LUFTHANSA, AIR FRANCE-KLM, EMIRATES, QATAR AIRWAYS, TURKISH AIRLINES, ETIHAD, FLIGHT RADAR "]
[null,"VEUILLEZ CONTACTER LA COMPAGNIE AÉRIENNE POUR CONFIRMER LE VOL ET VÉRIFIER LA DISPONIBILITÉ Source de la base de données: LUFTHANSA, AIR FRANCE-KLM, EMIRATES, QATAR AIRWAYS, TURKISH AIRLINES, ETIHAD, FLIGHT RADAR "]
[null,"Airline/Compagnie Aériénne","Flight number/Numéro de vol","Origin Airport Code/ Code de l'Aéroport Origine","Country Origin/ Pays d'Origine","Destination Airport Code/ Code de l'Aéroport de Destination","Country Destination/Pays de Destination","Available from date / Disponible à partir de","Estimated Time of Departure / Estimation de l'heure de depart","Avalable till date / Disponible jusque à","Estimated Time of Arrival / Estimation de l'heure d'arrivée","MONDAY/ LUNDI","TUESDAY/ MARDI","WEDNESDAY/MERCREDI","THURSDAY/ JEUDI ","FRIDAY/ VENDREDI","SATURDAY / SAMEDI","SUNDAY / DIMANCHE"]
[null,"AIR FRANCE","AF 0914","ACC","Ghana","CDG","France","2020-12-14",null,"2021-01-03",null,"X",null,null,null,null,"X"]
[null,"AIR FRANCE","AF 0584","ACC","Ghana","CDG","France","2020-12-14",null,"2021-01-03",null,null,"X",null,"X",null,null,"X"]
[null,"AIR FRANCE","AF6728","ACC","Ghana","CDG","France","2020-12-14",null,"2021-01-03",null,null,null,"X",null,"X"]
[null,"KLM","KL 0589","ACC","Ghana","AMS","Netherlands","2020-12-14",null,"2021-01-03",null,"X","X","X","X","X",null,"X"]
[null,"WARA AIR SERVICE EUROPE","SWT551","ACC","Ghana","OUA","Burkina Faso","2020-12-18",null,"2020-12-18",null,null,null,null,null,"X"]
[null,"Brussels Airlines","SN291","ACC","Ghana","ABJ","Cote d'Ivoire","24DEC20",2145,"26DEC20",2250,null,null,null,"X",null,"X"]
[null,"Brussels Airlines","SN291","ACC","Ghana","BRU","Belgium","24DEC20",2145,"26DEC20",740,null,null,null,"X",null,"X"]
[null,"Brussels Airlines","SN291","ACC","Ghana","ABJ","Cote d'Ivoire","31DEC20",2145,"31DEC20",2250,null,null,null,"X"]
[null,"Brussels Airlines","SN291","ACC","Ghana","BRU","Belgium","31DEC20",2145,"31DEC20",740,null,null,null,"X"]
[null,"Brussels Airlines","SN291","ACC","Ghana","ABJ","Cote d'Ivoire","2021-01-02",2145,"2021-01-02",2250,null,null,null,null,null,"X"]
[null,"Brussels Airlines","SN291","ACC","Ghana","BRU","Belgium","2021-01-02",2145,"2021-01-02",740,null,null,null,null,null,"X"]
[null,"Brussels Airlines","SN291","ACC","Ghana","ABJ","Cote d'Ivoire","2021-01-04",2145,"2021-01-04",2250,"X"]
[null,"Brussels Airlines","SN291","ACC","Ghana","BRU","Belgium","2021-01-04",2145,"2021-01-04",740,"X"]
[null,"Brussels Airlines","SN291","ACC","Ghana","ABJ","Cote d'Ivoire","2021-01-07",2145,"2021-01-14",2250,"X",null,null,"X",null,"X"]
[null,"Brussels Airlines","SN291","ACC","Ghana","BRU","Belgium","2021-01-07",2145,"2021-01-14",740,"X",null,null,"X",null,"X"]
[null,"Brussels Airlines","SN291","ACC","Ghana","ABJ","Cote d'Ivoire","17DEC20",2145,"17DEC20",2250,null,null,null,"X"]
[null,"Brussels Airlines","SN291","ACC","Ghana","BRU","Belgium","17DEC20",2145,"17DEC20",740,null,null,null,"X"]
[null,"Brussels Airlines","SN291","ACC","Ghana","ABJ","Cote d'Ivoire","19DEC20",2145,"19DEC20",2250,null,null,null,null,null,"X"]
[null,"Brussels Airlines","SN291","ACC","Ghana","BRU","Belgium","19DEC20",2145,"19DEC20",740,null,null,null,null,null,"X"]
[null,"Brussels Airlines","SN291","ACC","Ghana","ABJ","Cote d'Ivoire","21DEC20",2145,"21DEC20",2250,"X"]
[null,"Brussels Airlines","SN291","ACC","Ghana","BRU","Belgium","21DEC20",2145,"21DEC20",740,"X"]
[null,"Brussels Airlines","SN291","ACC","Ghana","ABJ","Cote d'Ivoire","28DEC20",2145,"28DEC20",2250,"X"]
[null,"Brussels Airlines","SN291","ACC","Ghana","BRU","Belgium","28DEC20",2145,"28DEC20",740,"X"]
[null,"EMIRATES","EK 0787","ACC","Ghana","ABJ","Cote d'Ivoire","2020-12-09","1130","2020-12-31","1235",null,null,"X",null,"X",null,"X"]
[null,"TURKISH AIRWAYS",null,"ACC","Ghana","IST","Turkey","2020-12-01",null,"2020-12-31",null,null,"X",null,null,"X"]
[null,"BRITISH AIRWAYS","BA78","ACC","Ghana","LHR","United Kingdom","2020-12-01","22H55",null,"5H30","X","X","X","X","X","X","X"]

{"sheet":" Flight data base","index":1,"n_rows":1162,"n_cols":19,"rows_kept":1162,"cut":false,"hidden":false,"merged":[]}
[null,"Airline/Compagnie Aériénne","Flight number/Numéro de vol","Origin Airport Code/ Code de l'Aéroport Origine","Country Origin/ Pays d'Origine","Destination Airport Code/ Code de l'Aéroport de Destination","Country Destination/Pays de Destination","Available from date / Disponible à partir de","Estimated Time of Departure / Estimation de l'heure de depart","Estimated Time of Arrival / Estimation de l'heure d'arrivée","Avalable till date / Disponible jusque à","MONDAY/ LUNDI","TUESDAY/ MARDI","WEDNESDAY/MERCREDI","THURSDAY/ JEUDI ","FRIDAY/ VENDREDI","SATURDAY / SAMEDI","SUNDAY / DIMANCHE","Fligh type PF passenger freighter (PF) full freighter (FF)/ CARGO SUR AVION PASSAGER PF - AVION CARGO FF"]
[1,"AIR FRANCE","AF0702","ABJ",{"$f":"_xlfn.XLOOKUP(' Flight data base'!D2,'airport codes'!$D$3:$D$2103,'airport codes'!$C$3:$C$2103)","v":"Cote d'Ivoire"},"CDG",{"$f":"_xlfn.XLOOKUP(' Flight data base'!F2,'airport codes'!$D$3:$D$2103,'airport codes'!$C$3:$C$2103)","v":"France"},"2020-12-14",null,null,"2021-01-03","X","X","X","X","X","X","X","PF"]
[2,"AIR FRANCE","AF0148","ABV",{"$f":"_xlfn.XLOOKUP(' Flight data base'!D3,'airport codes'!$D$3:$D$2103,'airport codes'!$C$3:$C$2103)","v":"Nigeria"},"CDG",{"$f":"_xlfn.XLOOKUP(' Flight data base'!F3,'airport codes'!$D$3:$D$2103,'airport codes'!$C$3:$C$2103)","v":"France"},"2020-12-14",null,null,"2021-01-03",null,null,"X",null,null,null,"X","PF"]
[3,"AIR FRANCE","AF 0914","ACC",{"$f":"_xlfn.XLOOKUP(' Flight data base'!D4,'airport codes'!$D$3:$D$2103,'airport codes'!$C$3:$C$2103)","v":"Ghana"},"CDG",{"$f":"_xlfn.XLOOKUP(' Flight data base'!F4,'airport codes'!$D$3:$D$2103,'airport codes'!$C$3:$C$2103)","v":"France"},"2020-12-14",null,null,"2021-01-03","X",null,null,null,null,"X",null,"PF"]
[4,"AIR FRANCE","AF 0584","ACC",{"$f":"_xlfn.XLOOKUP(' Flight data base'!D5,'airport codes'!$D$3:$D$2103,'airport codes'!$C$3:$C$2103)","v":"Ghana"},"CDG",{"$f":"_xlfn.XLOOKUP(' Flight data base'!F5,'airport codes'!$D$3:$D$2103,'airport codes'!$C$3:$C$2103)","v":"France"},"2020-12-14",null,null,"2021-01-03",null,"X",null,"X",null,null,"X","PF"]
[5,"AIR FRANCE","AF6728","ACC",{"$f":"_xlfn.XLOOKUP(' Flight data base'!D6,'airport codes'!$D$3:$D$2103,'airport codes'!$C$3:$C$2103)","v":"Ghana"},"CDG",{"$f":"_xlfn.XLOOKUP(' Flight data base'!F6,'airport codes'!$D$3:$D$2103,'airport codes'!$C$3:$C$2103)","v":"France"},"2020-12-14",null,null,"2021-01-03",null,null,"X",null,"X",null,null,"PF"]
[6,"KLM","KL 0589","ACC",{"$f":"_xlfn.XLOOKUP(' Flight data base'!D7,'airport codes'!$D$3:$D$2103,'airport codes'!$C$3:$C$2103)","v":"Ghana"},"AMS",{"$f":"_xlfn.XLOOKUP(' Flight data base'!F7,'airport codes'!$D$3:$D$2103,'airport codes'!$C$3:$C$2103)","v":"Netherlands"},"2020-12-14",null,null,"2021-01-03","X","X","X","X","X",null,"X","PF"]
[7,"KLM","KL 0765","AUA",{"$f":"_xlfn.XLOOKUP(' Flight data base'!D8,'airport codes'!$D$3:$D$2103,'airport codes'!$C$3:$C$2103)","v":"Aruba"},"AMS",{"$f":"_xlfn.XLOOKUP(' Flight data base'!F8,'airport codes'!$D$3:$D$2103,'airport codes'!$C$3:$C$2103)","v":"Netherlands"},"2020-12-28",null,null,"2021-01-03",null,null,null,null,null,"X",null,"PF"]
[8,"KLM","KL 0767","AUA",{"$f":"_xlfn.XLOOKUP(' Flight data base'!D9,'airport codes'!$D$3:$D$2103,'airport codes'!$C$3:$C$2103)","v":"Aruba"},"AMS",{"$f":"_xlfn.XLOOKUP(' Flight data base'!F9,'airport codes'!$D$3:$D$2103,'airport codes'!$C$3:$C$2103)","v":"Netherlands"},"2020-12-28",null,null,"2021-01-03",null,null,null,null,"X",null,"X","PF"]
[9,"KLM","KL 0771","AUA",{"$f":"_xlfn.XLOOKUP(' Flight data base'!D10,'airport codes'!$D$3:$D$2103,'airport codes'!$C$3:$C$2103)","v":"Aruba"},"AMS",{"$f":"_xlfn.XLOOKUP(' Flight data base'!F10,'airport codes'!$D$3:$D$2103,'airport codes'!$C$3:$C$2103)","v":"Netherlands"},"2020-12-14",null,null,"2021-01-03","X",null,"X",null,null,"X",null,"PF"]
[10,"KLM","KL 0773","AUA",{"$f":"_xlfn.XLOOKUP(' Flight data base'!D11,'airport codes'!$D$3:$D$2103,'airport codes'!$C$3:$C$2103)","v":"Aruba"},"AMS",{"$f":"_xlfn.XLOOKUP(' Flight data base'!F11,'airport codes'!$D$3:$D$2103,'airport codes'!$C$3:$C$2103)","v":"Netherlands"},"2020-12-14",null,null,"2021-01-03",null,null,null,"X",null,null,"X","PF"]
[11,"KLM","KL0779","AUA",{"$f":"_xlfn.XLOOKUP(' Flight data base'!D12,'airport codes'!$D$3:$D$2103,'airport codes'!$C$3:$C$2103)","v":"Aruba"},"AMS",{"$f":"_xlfn.XLOOKUP(' Flight data base'!F12,'airport codes'!$D$3:$D$2103,'airport codes'!$C$3:$C$2103)","v":"Netherlands"},"2020-12-14",null,null,"2021-01-03",null,"X",null,null,"X",null,null,"PF"]
[12,"AIR FRANCE","AF0775","BGF",{"$f":"_xlfn.XLOOKUP(' Flight data base'!D13,'airport codes'!$D$3:$D$2103,'airport codes'!$C$3:$C$2103)","v":"Central African Republic"},"CDG",{"$f":"_xlfn.XLOOKUP(' Flight data base'!F13,'airport codes'!$D$3:$D$2103,'airport codes'!$C$3:$C$2103)","v":"France"},"2020-12-14",null,null,"2021-01-03",null,"X",null,null,null,null,null,"PF"]
[13,"AIR FRANCE","AF0878","BGF",{"$f":"_xlfn.XLOOKUP(' Flight data base'!D14,'airport codes'!$D$3:$D$2103,'airport codes'!$C$3:$C$2103)","v":"Central African Republic"},"CDG",{"$f":"_xlfn.XLOOKUP(' Flight data base'!F14,'airport codes'!$D$3:$D$2103,'airport codes'!$C$3:$C$2103)","v":"France"},"2020-12-14",null,null,"2021-01-03",null,null,null,null,null,"X",null,"PF"]
[14,"AIR FRANCE","AF0530","BKO",{"$f":"_xlfn.XLOOKUP(' Flight data base'!D15,'airport codes'!$D$3:$D$2103,'airport codes'!$C$3:$C$2103)","v":"Mali"},"CDG",{"$f":"_xlfn.XLOOKUP(' Flight data base'!F15,'airport codes'!$D$3:$D$2103,'airport codes'!$C$3:$C$2103)","v":"France"},"2020-12-14",null,null,"2021-01-03","X","X","X","X","X","X","X","PF"]
[15,"AIR FRANCE","AF6747","BKO",{"$f":"_xlfn.XLOOKUP(' Flight data base'!D16,'airport codes'!$D$3:$D$2103,'airport codes'!$C$3:$C$2103)","v":"Mali"},"CDG",{"$f":"_xlfn.XLOOKUP(' Flight data base'!F16,'airport codes'!$D$3:$D$2103,'airport codes'!$C$3:$C$2103)","v":"France"},"2020-12-14",null,null,"2021-01-03",null,null,null,null,"X",null,null,"PF"]
[16,"KLM","KL 0765","BON",{"$f":"_xlfn.XLOOKUP(' Flight data base'!D17,'airport codes'!$D$3:$D$2103,'airport codes'!$C$3:$C$2103)","v":"Netherlands Antilles"},"AMS",{"$f":"_xlfn.XLOOKUP(' Flight data base'!F17,'airport codes'!$D$3:$D$2103,'airport codes'!$C$3:$C$2103)","v":"Netherlands"},"2020-12-28",null,null,"2021-01-03",null,null,null,null,null,"X",null,"PF"]
[17,"KLM","KL 0767","BON",{"$f":"_xlfn.XLOOKUP(' Flight data base'!D18,'airport codes'!$D$3:$D$2103,'airport codes'!$C$3:$C$2103)","v":"Netherlands Antilles"},"AMS",{"$f":"_xlfn.XLOOKUP(' Flight data base'!F18,'airport codes'!$D$3:$D$2103,'airport codes'!$C$3:$C$2103)","v":"Netherlands"},"2020-12-28",null,null,"2021-01-03",null,null,null,null,"X",null,"X","PF"]
[18,"KLM","KL 0771","BON",{"$f":"_xlfn.XLOOKUP(' Flight data base'!D19,'airport codes'!$D$3:$D$2103,'airport codes'!$C$3:$C$2103)","v":"Netherlands Antilles"},"AMS",{"$f":"_xlfn.XLOOKUP(' Flight data base'!F19,'airport codes'!$D$3:$D$2103,'airport codes'!$C$3:$C$2103)","v":"Netherlands"},"2020-12-14",null,null,"2021-01-03","X",null,"X",null,null,"X",null,"PF"]
[19,"KLM","KL 0773","BON",{"$f":"_xlfn.XLOOKUP(' Flight data base'!D20,'airport codes'!$D$3:$D$2103,'airport codes'!$C$3:$C$2103)","v":"Netherlands Antilles"},"AMS",{"$f":"_xlfn.XLOOKUP(' Flight data base'!F20,'airport codes'!$D$3:$D$2103,'airport codes'!$C$3:$C$2103)","v":"Netherlands"},"2020-12-14",null,null,"2021-01-03",null,null,null,"X",null,null,"X","PF"]
[20,"KLM","KL0779","BON",{"$f":"_xlfn.XLOOKUP(' Flight data base'!D21,'airport codes'!$D$3:$D$2103,'airport codes'!$C$3:$C$2103)","v":"Netherlands Antilles"},"AMS",{"$f":"_xlfn.XLOOKUP(' Flight data base'!F21,'airport codes'!$D$3:$D$2103,'airport codes'!$C$3:$C$2103)","v":"Netherlands"},"2020-12-14",null,null,"2021-01-03",null,"X",null,null,"X",null,null,"PF"]
[21,"AIR FRANCE","AF 0736","BZV",{"$f":"_xlfn.XLOOKUP(' Flight data base'!D22,'airport codes'!$D$3:$D$2103,'airport codes'!$C$3:$C$2103)","v":"Congo (ROC)"},"CDG",{"$f":"_xlfn.XLOOKUP(' Flight data base'!F22,'airport codes'!$D$3:$D$2103,'airport codes'!$C$3:$C$2103)","v":"France"},"2020-12-14",null,null,"2021-01-03",null,null,null,null,"X",null,"X","PF"]
[22,"AIR FRANCE","AF 0722","BZV",{"$f":"_xlfn.XLOOKUP(' Flight data base'!D23,'airport codes'!$D$3:$D$2103,'airport codes'!$C$3:$C$2103)","v":"Congo (ROC)"},"CDG",{"$f":"_xlfn.XLOOKUP(' Flight data base'!F23,'airport codes'!$D$3:$D$2103,'airport codes'!$C$3:$C$2103)","v":"France"},"2020-12-14",null,null,"2020-12-27",null,"X",null,"X",null,"X",null,"PF"]
[23,"AIR FRANCE","AF 0722","BZV",{"$f":"_xlfn.XLOOKUP(' Flight data base'!D24,'airport codes'!$D$3:$D$2103,'airport codes'!$C$3:$C$2103)","v":"Congo (ROC)"},"CDG",{"$f":"_xlfn.XLOOKUP(' Flight data base'!F24,'airport codes'!$D$3:$D$2103,'airport codes'!$C$3:$C$2103)","v":"France"},"2020-12-28",null,null,"2021-01-03",null,"X",null,null,null,"X",null,"PF"]
[24,"AIR FRANCE","AF0756","BZV",{"$f":"_xlfn.XLOOKUP(' Flight data base'!D25,'airport codes'!$D$3:$D$2103,'airport codes'!$C$3:$C$2103)","v":"Congo (ROC)"},"CDG",{"$f":"_xlfn.XLOOKUP(' Flight data base'!F25,'airport codes'!$D$3:$D$2103,'airport codes'!$C$3:$C$2103)","v":"France"},"2020-12-14",null,null,"2021-01-03","X",null,null,null,null,null,null,"PF"]
[25,"AIR FRANCE","AF 0852","CAY",{"$f":"_xlfn.XLOOKUP(' Flight data base'!D26,'airport codes'!$D$3:$D$2103,'airport codes'!$C$3:$C$2103)","v":"French Guiana"},"CDG",{"$f":"_xlfn.XLOOKUP(' Flight data base'!F26,'airport codes'!$D$3:$D$2103,'airport codes'!$C$3:$C$2103)","v":"France"},"2020-12-14",null,null,"2021-01-03","X","X","X","X","X","X","X","PF"]
[26,"AIR FRANCE","AF0724","CKY",{"$f":"_xlfn.XLOOKUP(' Flight data base'!D27,'airport codes'!$D$3:$D$2103,'airport codes'!$C$3:$C$2103)","v":"Guinea"},"CDG",{"$f":"_xlfn.XLOOKUP(' Flight data base'!F27,'airport codes'!$D$3:$D$2103,'airport codes'!$C$3:$C$2103)","v":"France"},"2020-12-14",null,null,"2021-01-03",null,null,"X",null,"X",null,null,"PF"]
[27,"AIR FRANCE","AF0596","CKY",{"$f":"_xlfn.XLOOKUP(' Flight data base'!D28,'airport codes'!$D$3:$D$2103,'airport codes'!$C$3:$C$2103)","v":"Guinea"},"CDG",{"$f":"_xlfn.XLOOKUP(' Flight data base'!F28,'airport codes'!$D$3:$D$2103,'airport codes'!$C$3:$C$2103)","v":"France"},"2020-12-14",null,null,"2021-01-03",null,"X",null,"X",null,"X",null,"PF"]
[28,"AIR FRANCE","AF0727","CKY",{"$f":"_xlfn.XLOOKUP(' Flight data base'!D29,'airport codes'!$D$3:$D$2103,'airport codes'!$C$3:$C$2103)","v":"Guinea"},"CDG",{"$f":"_xlfn.XLOOKUP(' Flight data base'!F29,'airport codes'!$D$3:$D$2103,'airport codes'!$C$3:$C$2103)","v":"France"},"2020-12-14",null,null,"2021-01-03","X",null,null,null,null,null,null,"PF"]
[29,"AIR FRANCE","AF0751","CKY",{"$f":"_xlfn.XLOOKUP(' Flight data base'!D30,'airport codes'!$D$3:$D$2103,'airport codes'!$C$3:$C$2103)","v":"Guinea"},"CDG",{"$f":"_xlfn.XLOOKUP(' Flight data base'!F30,'airport codes'!$D$3:$D$2103,'airport codes'!$C$3:$C$2103)","v":"France"},"2020-12-14",null,null,"2021-01-03",null,null,null,null,null,null,"X","PF"]
[30,"AIR FRANCE","AF6747","CMN",{"$f":"_xlfn.XLOOKUP(' Flight data base'!D31,'airport codes'!$D$3:$D$2103,'airport codes'!$C$3:$C$2103)","v":"Morocco"},"CDG",{"$f":"_xlfn.XLOOKUP(' Flight data base'!F31,'airport codes'!$D$3:$D$2103,'airport codes'!$C$3:$C$2103)","v":"France"},"2020-12-14",null,null,"2021-01-03",null,null,null,null,"X",null,null,"PF"]
[31,"AIR FRANCE","AF804","COO",{"$f":"_xlfn.XLOOKUP(' Flight data base'!D32,'airport codes'!$D$3:$D$2103,'airport codes'!$C$3:$C$2103)","v":"Benin"},"CDG",{"$f":"_xlfn.XLOOKUP(' Flight data base'!F32,'airport codes'!$D$3:$D$2103,'airport codes'!$C$3:$C$2103)","v":"France"},"2020-12-14",null,null,"2021-01-03","X",null,"X",null,"X",null,"X","PF"]
[32,"KLM","KL0597","CPT",{"$f":"_xlfn.XLOOKUP(' Flight data base'!D33,'airport codes'!$D$3:$D$2103,'airport codes'!$C$3:$C$2103)","v":"South Africa"},"AMS",{"$f":"_xlfn.XLOOKUP(' Flight data base'!F33,'airport codes'!$D$3:$D$2103,'airport codes'!$C$3:$C$2103)","v":"Netherlands"},"2020-12-07",null,null,"2021-01-03",null,"X","X","X","X","X","X","PF"]
[33,"KLM","KL0735","CUR",{"$f":"_xlfn.XLOOKUP(' Flight data base'!D34,'airport codes'!$D$3:$D$2103,'airport codes'!$C$3:$C$2103)","v":"Netherlands Antilles"},"AMS",{"$f":"_xlfn.XLOOKUP(' Flight data base'!F34,'airport codes'!$D$3:$D$2103,'airport codes'!$C$3:$C$2103)","v":"Netherlands"},"2020-12-14",null,null,"2021-01-03","X","X","X","X","X","X","X","PF"]
[34,"KLM","KL0515","DAR",{"$f":"_xlfn.XLOOKUP(' Flight data base'!D35,'airport codes'!$D$3:$D$2103,'airport codes'!$C$3:$C$2103)","v":"Tanzania"},"AMS",{"$f":"_xlfn.XLOOKUP(' Flight data base'!F35,'airport codes'!$D$3:$D$2103,'airport codes'!$C$3:$C$2103)","v":"Netherlands"},"2020-12-07",null,null,"2021-01-03",null,null,null,"X",null,null,"X","PF"]
[35,"KLM","KL0569","DAR",{"$f":"_xlfn.XLOOKUP(' Flight data base'!D36,'airport codes'!$D$3:$D$2103,'airport codes'!$C$3:$C$2103)","v":"Tanzania"},"AMS",{"$f":"_xlfn.XLOOKUP(' Flight data base'!F36,'airport codes'!$D$3:$D$2103,'airport codes'!$C$3:$C$2103)","v":"Netherlands"},"2020-12-07",null,null,"2021-01-03",null,null,"X",null,null,"X",null,"PF"]
[36,"KLM","KL0571","DAR",{"$f":"_xlfn.XLOOKUP(' Flight data base'!D37,'airport codes'!$D$3:$D$2103,'airport codes'!$C$3:$C$2103)","v":"Tanzania"},"AMS",{"$f":"_xlfn.XLOOKUP(' Flight data base'!F37,'airport codes'!$D$3:$D$2103,'airport codes'!$C$3:$C$2103)","v":"Netherlands"},"2020-12-07",null,null,"2021-01-03",null,"X",null,null,null,null,null,"PF"]
[37,"KLM","KL0567","DAR",{"$f":"_xlfn.XLOOKUP(' Flight data base'!D38,'airport codes'!$D$3:$D$2103,'airport codes'!$C$3:$C$2103)","v":"Tanzania"},"AMS",{"$f":"_xlfn.XLOOKUP(' Flight data base'!F38,'airport codes'!$D$3:$D$2103,'airport codes'!$C$3:$C$2103)","v":"Netherlands"},"2020-12-07",null,null,"2021-01-03",null,null,null,null,"X",null,null,"PF"]
[38,"AIR FRANCE","AF 0982","DLA",{"$f":"_xlfn.XLOOKUP(' Flight data base'!D39,'airport codes'!$D$3:$D$2103,'airport codes'!$C$3:$C$2103)","v":"Cameroon"},"CDG",{"$f":"_xlfn.XLOOKUP(' Flight data base'!F39,'airport codes'!$D$3:$D$2103,'airport codes'!$C$3:$C$2103)","v":"France"},"2020-12-14",null,null,"2021-01-03",null,null,null,"X",null,null,"X","PF"]
[39,"AIR FRANCE","AF6746","DLA",{"$f":"_xlfn.XLOOKUP(' Flight data base'!D40,'airport codes'!$D$3:$D$2103,'airport codes'!$C$3:$C$2103)","v":"Cameroon"},"CDG",{"$f":"_xlfn.XLOOKUP(' Flight data base'!F40,'airport codes'!$D$3:$D$2103,'airport codes'!$C$3:$C$2103)","v":"France"},"2020-12-14",null,null,"2021-01-03","X",null,null,null,null,null,null,"PF"]
[40,"AIR FRANCE","AF0900","DLA",{"$f":"_xlfn.XLOOKUP(' Flight data base'!D41,'airport codes'!$D$3:$D$2103,'airport codes'!$C$3:$C$2103)","v":"Cameroon"},"CDG",{"$f":"_xlfn.XLOOKUP(' Flight data base'!F41,'airport codes'!$D$3:$D$2103,'airport codes'!$C$3:$C$2103)","v":"France"},"2020-12-14",null,null,"2021-01-03","X",null,null,null,"X",null,null,"PF"]
[41,"AIR FRANCE","AF 0718","DSS",{"$f":"_xlfn.XLOOKUP(' Flight data base'!D42,'airport codes'!$D$3:$D$2103,'airport codes'!$C$3:$C$2103)","v":"Senegal"},"CDG",{"$f":"_xlfn.XLOOKUP(' Flight data base'!F42,'airport codes'!$D$3:$D$2103,'airport codes'!$C$3:$C$2103)","v":"France"},"2020-12-14",null,null,"2021-01-03","X","X","X","X","X","X","X","PF"]
[42,"KLM","KL0535","EBB",{"$f":"_xlfn.XLOOKUP(' Flight data base'!D43,'airport codes'!$D$3:$D$2103,'airport codes'!$C$3:$C$2103)","v":"Uganda"},"AMS",{"$f":"_xlfn.XLOOKUP(' Flight data base'!F43,'airport codes'!$D$3:$D$2103,'airport codes'!$C$3:$C$2103)","v":"Netherlands"},"2020-12-14",null,null,"2021-01-03",null,null,"X",null,"X",null,null,"PF"]
[43,"KLM","KL0537","EBB",{"$f":"_xlfn.XLOOKUP(' Flight data base'!D44,'airport codes'!$D$3:$D$2103,'airport codes'!$C$3:$C$2103)","v":"Uganda"},"AMS",{"$f":"_xlfn.XLOOKUP(' Flight data base'!F44,'airport codes'!$D$3:$D$2103,'airport codes'!$C$3:$C$2103)","v":"Netherlands"},"2020-12-14",null,null,"2021-01-03","X",null,null,null,null,"X",null,"PF"]
[44,"AIR FRANCE","AF 0842","FDF",{"$f":"_xlfn.XLOOKUP(' Flight data base'!D45,'airport codes'!$D$3:$D$2103,'airport codes'!$C$3:$C$2103)","v":"Martinique"},"CDG",{"$f":"_xlfn.XLOOKUP(' Flight data base'!F45,'airport codes'!$D$3:$D$2103,'airport codes'!$C$3:$C$2103)","v":"France"},"2020-12-14",null,null,"2021-01-03","X","X","X","X","X","X","X","PF"]
[45,"AIR FRANCE","AF0848","FDF",{"$f":"_xlfn.XLOOKUP(' Flight data base'!D46,'airport codes'!$D$3:$D$2103,'airport codes'!$C$3:$C$2103)","v":"Martinique"},"CDG",{"$f":"_xlfn.XLOOKUP(' Flight data base'!F46,'airport codes'!$D$3:$D$2103,'airport codes'!$C$3:$C$2103)","v":"France"},"2020-12-14",null,null,"2021-01-03","X","X","X","X","X","X","X","PF"]
[46,"AIR FRANCE","AF0810","FDF",{"$f":"_xlfn.XLOOKUP(' Flight data base'!D47,'airport codes'!$D$3:$D$2103,'airport codes'!$C$3:$C$2103)","v":"Martinique"},"CDG",{"$f":"_xlfn.XLOOKUP(' Flight data base'!F47,'airport codes'!$D$3:$D$2103,'airport codes'!$C$3:$C$2103)","v":"France"},"2020-12-14",null,null,"2021-01-03","X",null,null,null,"X",null,"X","PF"]
[47,"AIR FRANCE","AF0850","FDF",{"$f":"_xlfn.XLOOKUP(' Flight data base'!D48,'airport codes'!$D$3:$D$2103,'airport codes'!$C$3:$C$2103)","v":"Martinique"},"CDG",{"$f":"_xlfn.XLOOKUP(' Flight data base'!F48,'airport codes'!$D$3:$D$2103,'airport codes'!$C$3:$C$2103)","v":"France"},"2020-12-14",null,null,"2021-01-03",null,null,null,"X",null,"X",null,"PF"]
[48,"AIR FRANCE","AF0756","FIH",{"$f":"_xlfn.XLOOKUP(' Flight data base'!D49,'airport codes'!$D$3:$D$2103,'airport codes'!$C$3:$C$2103)","v":"Congo (DRC)"},"CDG",{"$f":"_xlfn.XLOOKUP(' Flight data base'!F49,'airport codes'!$D$3:$D$2103,'airport codes'!$C$3:$C$2103)","v":"France"},"2020-12-14",null,null,"2021-01-03","X",null,null,null,null,null,null,"PF"]
[49,"AIR FRANCE","AF 0722","FIH",{"$f":"_xlfn.XLOOKUP(' Flight data base'!D50,'airport codes'!$D$3:$D$2103,'airport codes'!$C$3:$C$2103)","v":"Congo (DRC)"},"CDG",{"$f":"_xlfn.XLOOKUP(' Flight data base'!F50,'airport codes'!$D$3:$D$2103,'airport codes'!$C$3:$C$2103)","v":"France"},"2020-12-14",null,null,"2020-12-27",null,"X",null,"X",null,"X",null,"PF"]
[50,"AIR FRANCE","AF 0722","FIH",{"$f":"_xlfn.XLOOKUP(' Flight data base'!D51,'airport codes'!$D$3:$D$2103,'airport codes'!$C$3:$C$2103)","v":"Congo (DRC)"},"CDG",{"$f":"_xlfn.XLOOKUP(' Flight data base'!F51,'airport codes'!$D$3:$D$2103,'airport codes'!$C$3:$C$2103)","v":"France"},"2020-12-28",null,null,"2021-01-03",null,"X",null,null,null,"X",null,"PF"]
[51,"AIR FRANCE","AF0736","FIH",{"$f":"_xlfn.XLOOKUP(' Flight data base'!D52,'airport codes'!$D$3:$D$2103,'airport codes'!$C$3:$C$2103)","v":"Congo (DRC)"},"CDG",{"$f":"_xlfn.XLOOKUP(' Flight data base'!F52,'airport codes'!$D$3:$D$2103,'airport codes'!$C$3:$C$2103)","v":"France"},"2020-12-14",null,null,"2021-01-03",null,null,null,null,"X",null,"X","PF"]
[52,"AIR FRANCE","AF0596","FNA",{"$f":"_xlfn.XLOOKUP(' Flight data base'!D53,'airport codes'!$D$3:$D$2103,'airport codes'!$C$3:$C$2103)","v":"Sierra Leone"},"CDG",{"$f":"_xlfn.XLOOKUP(' Flight data base'!F53,'airport codes'!$D$3:$D$2103,'airport codes'!$C$3:$C$2103)","v":"France"},"2020-12-14",null,null,"2021-01-03",null,"X",null,"X",null,"X",null,"PF"]
[53,"AIR FRANCE","AF0820","HAV",{"$f":"_xlfn.XLOOKUP(' Flight data base'!D54,'airport codes'!$D$3:$D$2103,'airport codes'!$C$3:$C$2103)","v":"Cuba"},"CDG",{"$f":"_xlfn.XLOOKUP(' Flight data base'!F54,'airport codes'!$D$3:$D$2103,'airport codes'!$C$3:$C$2103)","v":"France"},"2020-12-14",null,null,"2021-01-03",null,null,null,"X",null,"X",null,"PF"]
[54,"MARTINAIR","MP 8320","HRE",{"$f":"_xlfn.XLOOKUP(' Flight data base'!D55,'airport codes'!$D$3:$D$2103,'airport codes'!$C$3:$C$2103)","v":"Zimbabwe"},"AMS",{"$f":"_xlfn.XLOOKUP(' Flight data base'!F55,'airport codes'!$D$3:$D$2103,'airport codes'!$C$3:$C$2103)","v":"Netherlands"},"2020-12-14",null,null,"2021-01-03",null,"X",null,null,null,null,null,"FF"]
[55,"MARTINAIR","MP 8340","HRE",{"$f":"_xlfn.XLOOKUP(' Flight data base'!D56,'airport codes'!$D$3:$D$2103,'airport codes'!$C$3:$C$2103)","v":"Zimbabwe"},"AMS",{"$f":"_xlfn.XLOOKUP(' Flight data base'!F56,'airport codes'!$D$3:$D$2103,'airport codes'!$C$3:$C$2103)","v":"Netherlands"},"2020-12-14",null,null,"2020-12-20",null,null,null,"X",null,null,null,"FF"]
[56,"MARTINAIR","MP 8370","HRE",{"$f":"_xlfn.XLOOKUP(' Flight data base'!D57,'airport codes'!$D$3:$D$2103,'airport codes'!$C$3:$C$2103)","v":"Zimbabwe"},"AMS",{"$f":"_xlfn.XLOOKUP(' Flight data base'!F57,'airport codes'!$D$3:$D$2103,'airport codes'!$C$3:$C$2103)","v":"Netherlands"},"2020-12-14",null,null,"2021-01-03",null,null,null,null,null,null,"X","FF"]
[57,"AIR FRANCE","AF0668","JIB",{"$f":"_xlfn.XLOOKUP(' Flight data base'!D58,'airport codes'!$D$3:$D$2103,'airport codes'!$C$3:$C$2103)","v":"Djibouti"},"CDG",{"$f":"_xlfn.XLOOKUP(' Flight data base'!F58,'airport codes'!$D$3:$D$2103,'airport codes'!$C$3:$C$2103)","v":"France"},"2020-12-14",null,null,"2021-01-03",null,null,null,null,"X",null,null,"PF"]
[58,"AIR FRANCE","AF6749","JIB",{"$f":"_xlfn.XLOOKUP(' Flight data base'!D59,'airport codes'!$D$3:$D$2103,'airport codes'!$C$3:$C$2103)","v":"Djibouti"},"CDG",{"$f":"_xlfn.XLOOKUP(' Flight data base'!F59,'airport codes'!$D$3:$D$2103,'airport codes'!$C$3:$C$2103)","v":"France"},"2020-12-14",null,null,"2021-01-03",null,"X",null,null,null,null,null,"PF"]
[59,"AIR FRANCE","AF 0990","JNB",{"$f":"_xlfn.XLOOKUP(' Flight data base'!D60,'airport codes'!$D$3:$D$2103,'airport codes'!$C$3:$C$2103)","v":"South Africa"},"CDG",{"$f":"_xlfn.XLOOKUP(' Flight data base'!F60,'airport codes'!$D$3:$D$2103,'airport codes'!$C$3:$C$2103)","v":"France"},"2020-12-14",null,null,"2021-01-03","X","X","X","X","X","X","X","PF"]
[60,"KLM","KL 0591","JNB",{"$f":"_xlfn.XLOOKUP(' Flight data base'!D61,'airport codes'!$D$3:$D$2103,'airport codes'!$C$3:$C$2103)","v":"South Africa"},"AMS",{"$f":"_xlfn.XLOOKUP(' Flight data base'!F61,'airport codes'!$D$3:$D$2103,'airport codes'!$C$3:$C$2103)","v":"Netherlands"},"2020-12-14",null,null,"2021-01-03","X","X","X","X","X","X","X","PF"]
[61,"MARTINAIR","MP 8320","JNB",{"$f":"_xlfn.XLOOKUP(' Flight data base'!D62,'airport codes'!$D$3:$D$2103,'airport codes'!$C$3:$C$2103)","v":"South Africa"},"AMS",{"$f":"_xlfn.XLOOKUP(' Flight data base'!F62,'airport codes'!$D$3:$D$2103,'airport codes'!$C$3:$C$2103)","v":"Netherlands"},"2020-12-14",null,null,"2021-01-03",null,"X",null,null,null,null,null,"FF"]
[62,"MARTINAIR","MP 8140","JNB",{"$f":"_xlfn.XLOOKUP(' Flight data base'!D63,'airport codes'!$D$3:$D$2103,'airport codes'!$C$3:$C$2103)","v":"South Africa"},"AMS",{"$f":"_xlfn.XLOOKUP(' Flight data base'!F63,'airport codes'!$D$3:$D$2103,'airport codes'!$C$3:$C$2103)","v":"Netherlands"},"2020-12-14",null,null,"2021-01-03",null,null,"X",null,null,null,null,"FF"]
[63,"MARTINAIR","MP 8340","JNB",{"$f":"_xlfn.XLOOKUP(' Flight data base'!D64,'airport codes'!$D$3:$D$2103,'airport codes'!$C$3:$C$2103)","v":"South Africa"},"AMS",{"$f":"_xlfn.XLOOKUP(' Flight data base'!F64,'airport codes'!$D$3:$D$2103,'airport codes'!$C$3:$C$2103)","v":"Netherlands"},"2020-12-14",null,null,"2021-01-03",null,null,null,"X",null,null,null,"FF"]
[64,"MARTINAIR","MP 8560","JNB",{"$f":"_xlfn.XLOOKUP(' Flight data base'!D65,'airport codes'!$D$3:$D$2103,'airport codes'!$C$3:$C$2103)","v":"South Africa"},"AMS",{"$f":"_xlfn.XLOOKUP(' Flight data base'!F65,'airport codes'!$D$3:$D$2103,'airport codes'!$C$3:$C$2103)","v":"Netherlands"},"2020-12-14",null,null,"2021-01-03",null,null,null,null,null,"X",null,"FF"]
[65,"MARTINAIR","MP 8370","JNB",{"$f":"_xlfn.XLOOKUP(' Flight data base'!D66,'airport codes'!$D$3:$D$2103,'airport codes'!$C$3:$C$2103)","v":"South Africa"},"AMS",{"$f":"_xlfn.XLOOKUP(' Flight data base'!F66,'airport codes'!$D$3:$D$2103,'airport codes'!$C$3:$C$2103)","v":"Netherlands"},"2020-12-14",null,null,"2021-01-03",null,null,null,null,null,null,"X","FF"]
[66,"KLM","KL0567","JRO",{"$f":"_xlfn.XLOOKUP(' Flight data base'!D67,'airport codes'!$D$3:$D$2103,'airport codes'!$C$3:$C$2103)","v":"Tanzania"},"AMS",{"$f":"_xlfn.XLOOKUP(' Flight data base'!F67,'airport codes'!$D$3:$D$2103,'airport codes'!$C$3:$C$2103)","v":"Netherlands"},"2020-12-07",null,null,"2021-01-03",null,null,null,null,"X",null,null,"PF"]
[67,"KLM","KL0569","JRO",{"$f":"_xlfn.XLOOKUP(' Flight data base'!D68,'airport codes'!$D$3:$D$2103,'airport codes'!$C$3:$C$2103)","v":"Tanzania"},"AMS",{"$f":"_xlfn.XLOOKUP(' Flight data base'!F68,'airport codes'!$D$3:$D$2103,'airport codes'!$C$3:$C$2103)","v":"Netherlands"},"2020-12-07",null,null,"2021-01-03",null,null,"X",null,null,"X",null,"PF"]
[68,"KLM","KL0571","JRO",{"$f":"_xlfn.XLOOKUP(' Flight data base'!D69,'airport codes'!$D$3:$D$2103,'airport codes'!$C$3:$C$2103)","v":"Tanzania"},"AMS",{"$f":"_xlfn.XLOOKUP(' Flight data base'!F69,'airport codes'!$D$3:$D$2103,'airport codes'!$C$3:$C$2103)","v":"Netherlands"},"2020-12-07",null,null,"2021-01-03",null,"X",null,null,null,null,null,"PF"]
[69,"KLM","KL0535","KGL",{"$f":"_xlfn.XLOOKUP(' Flight data base'!D70,'airport codes'!$D$3:$D$2103,'airport codes'!$C$3:$C$2103)","v":"Rwanda"},"AMS",{"$f":"_xlfn.XLOOKUP(' Flight data base'!F70,'airport codes'!$D$3:$D$2103,'airport codes'!$C$3:$C$2103)","v":"Netherlands"},"2020-12-14",null,null,"2021-01-03",null,null,"X",null,"X",null,null,"PF"]
[70,"KLM","KL0537","KGL",{"$f":"_xlfn.XLOOKUP(' Flight data base'!D71,'airport codes'!$D$3:$D$2103,'airport codes'!$C$3:$C$2103)","v":"Rwanda"},"AMS",{"$f":"_xlfn.XLOOKUP(' Flight data base'!F71,'airport codes'!$D$3:$D$2103,'airport codes'!$C$3:$C$2103)","v":"Netherlands"},"2020-12-14",null,null,"2021-01-03","X",null,null,null,null,"X",null,"PF"]
[71,"AIR FRANCE","AF 0928","LAD",{"$f":"_xlfn.XLOOKUP(' Flight data base'!D72,'airport codes'!$D$3:$D$2103,'airport codes'!$C$3:$C$2103)","v":"Angola"},"CDG",{"$f":"_xlfn.XLOOKUP(' Flight data base'!F72,'airport codes'!$D$3:$D$2103,'airport codes'!$C$3:$C$2103)","v":"France"},"2020-12-14",null,null,"2021-01-03",null,null,"X",null,null,null,null,"PF"]
[72,"AIR FRANCE","AF 0926","LBV",{"$f":"_xlfn.XLOOKUP(' Flight data base'!D73,'airport codes'!$D$3:$D$2103,'airport codes'!$C$3:$C$2103)","v":"Gabon"},"CDG",{"$f":"_xlfn.XLOOKUP(' Flight data base'!F73,'airport codes'!$D$3:$D$2103,'airport codes'!$C$3:$C$2103)","v":"France"},"2020-12-14",null,null,"2021-01-03",null,"X",null,null,"X",null,"X","PF"]
[73,"AIR FRANCE","AF 0306","LFW",{"$f":"_xlfn.XLOOKUP(' Flight data base'!D74,'airport codes'!$D$3:$D$2103,'airport codes'!$C$3:$C$2103)","v":"Togo"},"CDG",{"$f":"_xlfn.XLOOKUP(' Flight data base'!F74,'airport codes'!$D$3:$D$2103,'airport codes'!$C$3:$C$2103)","v":"France"},"2020-12-14",null,null,"2021-01-03","X",null,"X","X",null,"X",null,"PF"]
[74,"AIR FRANCE","AF0860","LFW",{"$f":"_xlfn.XLOOKUP(' Flight data base'!D75,'airport codes'!$D$3:$D$2103,'airport codes'!$C$3:$C$2103)","v":"Togo"},"CDG",{"$f":"_xlfn.XLOOKUP(' Flight data base'!F75,'airport codes'!$D$3:$D$2103,'airport codes'!$C$3:$C$2103)","v":"France"},"2020-12-07",null,null,"2021-01-03",null,"X",null,null,null,null,"X","PF"]
[75,"AIR FRANCE","AF6906","LFW",{"$f":"_xlfn.XLOOKUP(' Flight data base'!D76,'airport codes'!$D$3:$D$2103,'airport codes'!$C$3:$C$2103)","v":"Togo"},"CDG",{"$f":"_xlfn.XLOOKUP(' Flight data base'!F76,'airport codes'!$D$3:$D$2103,'airport codes'!$C$3:$C$2103)","v":"France"},"2020-12-14",null,null,"2021-01-03",null,null,null,null,null,null,"X","PF"]
[76,"AIR FRANCE","AF0148","LOS",{"$f":"_xlfn.XLOOKUP(' Flight data base'!D77,'airport codes'!$D$3:$D$2103,'airport codes'!$C$3:$C$2103)","v":"Nigeria"},"CDG",{"$f":"_xlfn.XLOOKUP(' Flight data base'!F77,'airport codes'!$D$3:$D$2103,'airport codes'!$C$3:$C$2103)","v":"France"},"2020-12-07",null,null,"2021-01-03","X",null,"X",null,"X",null,"X","PF"]
[77,"KLM","KL0587","LOS",{"$f":"_xlfn.XLOOKUP(' Flight data base'!D78,'airport codes'!$D$3:$D$2103,'airport codes'!$C$3:$C$2103)","v":"Nigeria"},"AMS",{"$f":"_xlfn.XLOOKUP(' Flight data base'!F78,'airport codes'!$D$3:$D$2103,'airport codes'!$C$3:$C$2103)","v":"Netherlands"},"2020-12-07",null,null,"2020-12-27",null,"X","X","X","X",null,null,"PF"]
[78,"KLM","KL0587","LOS",{"$f":"_xlfn.XLOOKUP(' Flight data base'!D79,'airport codes'!$D$3:$D$2103,'airport codes'!$C$3:$C$2103)","v":"Nigeria"},"AMS",{"$f":"_xlfn.XLOOKUP(' Flight data base'!F79,'airport codes'!$D$3:$D$2103,'airport codes'!$C$3:$C$2103)","v":"Netherlands"},"2020-12-28",null,null,"2021-01-03","X","X","X","X","X",null,null,"PF"]
[79,"AIR FRANCE","AF0470","MRU",{"$f":"_xlfn.XLOOKUP(' Flight data base'!D80,'airport codes'!$D$3:$D$2103,'airport codes'!$C$3:$C$2103)","v":"Mauritius"},"CDG",{"$f":"_xlfn.XLOOKUP(' Flight data base'!F80,'airport codes'!$D$3:$D$2103,'airport codes'!$C$3:$C$2103)","v":"France"},"2020-12-14",null,null,"2021-01-03",null,null,"X",null,"X",null,"X","PF"]
[80,"AIR FRANCE","AF0814","NBO",{"$f":"_xlfn.XLOOKUP(' Flight data base'!D81,'airport codes'!$D$3:$D$2103,'airport codes'!$C$3:$C$2103)","v":"Kenya"},"CDG",{"$f":"_xlfn.XLOOKUP(' Flight data base'!F81,'airport codes'!$D$3:$D$2103,'airport codes'!$C$3:$C$2103)","v":"France"},"2020-12-14",null,null,"2021-01-03",null,"X",null,"X",null,"X",null,"PF"]
[81,"AIR FRANCE","AF6749","NBO",{"$f":"_xlfn.XLOOKUP(' Flight data base'!D82,'airport codes'!$D$3:$D$2103,'airport codes'!$C$3:$C$2103)","v":"Kenya"},"CDG",{"$f":"_xlfn.XLOOKUP(' Flight data base'!F82,'airport codes'!$D$3:$D$2103,'airport codes'!$C$3:$C$2103)","v":"France"},"2020-12-14",null,null,"2021-01-03",null,"X",null,null,null,null,null,"PF"]
[82,"AIR FRANCE","AF6906","NBO",{"$f":"_xlfn.XLOOKUP(' Flight data base'!D83,'airport codes'!$D$3:$D$2103,'airport codes'!$C$3:$C$2103)","v":"Kenya"},"CDG",{"$f":"_xlfn.XLOOKUP(' Flight data base'!F83,'airport codes'!$D$3:$D$2103,'airport codes'!$C$3:$C$2103)","v":"France"},"2020-12-14",null,null,"2021-01-03",null,"X","X",null,null,null,null,"PF"]
[83,"KLM","KL 0565","NBO",{"$f":"_xlfn.XLOOKUP(' Flight data base'!D84,'airport codes'!$D$3:$D$2103,'airport codes'!$C$3:$C$2103)","v":"Kenya"},"AMS",{"$f":"_xlfn.XLOOKUP(' Flight data base'!F84,'airport codes'!$D$3:$D$2103,'airport codes'!$C$3:$C$2103)","v":"Netherlands"},"2020-12-14",null,null,"2021-01-03","X",null,"X",null,"X","X","X","PF"]
[84,"AIR FRANCE","AF6908","NBO",{"$f":"_xlfn.XLOOKUP(' Flight data base'!D85,'airport codes'!$D$3:$D$2103,'airport codes'!$C$3:$C$2103)","v":"Kenya"},"CDG",{"$f":"_xlfn.XLOOKUP(' Flight data base'!F85,'airport codes'!$D$3:$D$2103,'airport codes'!$C$3:$C$2103)","v":"France"},"2020-12-07",null,null,"2020-12-20","X",null,null,null,null,null,null,"FF"]
[85,"MARTINAIR","MP 8320","NBO",{"$f":"_xlfn.XLOOKUP(' Flight data base'!D86,'airport codes'!$D$3:$D$2103,'airport codes'!$C$3:$C$2103)","v":"Kenya"},"AMS",{"$f":"_xlfn.XLOOKUP(' Flight data base'!F86,'airport codes'!$D$3:$D$2103,'airport codes'!$C$3:$C$2103)","v":"Netherlands"},"2020-12-14",null,null,"2021-01-03",null,"X",null,null,null,null,null,"FF"]
[86,"MARTINAIR","MP 8140","NBO",{"$f":"_xlfn.XLOOKUP(' Flight data base'!D87,'airport codes'!$D$3:$D$2103,'airport codes'!$C$3:$C$2103)","v":"Kenya"},"AMS",{"$f":"_xlfn.XLOOKUP(' Flight data base'!F87,'airport codes'!$D$3:$D$2103,'airport codes'!$C$3:$C$2103)","v":"Netherlands"},"2020-12-14",null,null,"2021-01-03",null,null,"X",null,null,null,null,"FF"]
[87,"MARTINAIR","MP 8340","NBO",{"$f":"_xlfn.XLOOKUP(' Flight data base'!D88,'airport codes'!$D$3:$D$2103,'airport codes'!$C$3:$C$2103)","v":"Kenya"},"AMS",{"$f":"_xlfn.XLOOKUP(' Flight data base'!F88,'airport codes'!$D$3:$D$2103,'airport codes'!$C$3:$C$2103)","v":"Netherlands"},"2020-12-14",null,null,"2021-01-03",null,null,null,"X",null,null,null,"FF"]
[88,"MARTINAIR","MP 8560","NBO",{"$f":"_xlfn.XLOOKUP(' Flight data base'!D89,'airport codes'!$D$3:$D$2103,'airport codes'!$C$3:$C$2103)","v":"Kenya"},"AMS",{"$f":"_xlfn.XLOOKUP(' Flight data base'!F89,'airport codes'!$D$3:$D$2103,'airport codes'!$C$3:$C$2103)","v":"Netherlands"},"2020-12-14",null,null,"2021-01-03",null,null,null,null,null,"X",null,"FF"]
[89,"MARTINAIR","MP 8370","NBO",{"$f":"_xlfn.XLOOKUP(' Flight data base'!D90,'airport codes'!$D$3:$D$2103,'airport codes'!$C$3:$C$2103)","v":"Kenya"},"AMS",{"$f":"_xlfn.XLOOKUP(' Flight data base'!F90,'airport codes'!$D$3:$D$2103,'airport codes'!$C$3:$C$2103)","v":"Netherlands"},"2020-12-14",null,null,"2021-01-03",null,null,null,null,null,null,"X","FF"]
[90,"WARA AIR SERVICE EUROPE","SWT551","LGG",{"$f":"_xlfn.XLOOKUP(' Flight data base'!D91,'airport codes'!$D$3:$D$2103,'airport codes'!$C$3:$C$2103)","v":"Belgium"},"ABJ",{"$f":"_xlfn.XLOOKUP(' Flight data base'!F91,'airport codes'!$D$3:$D$2103,'airport codes'!$C$3:$C$2103)","v":"Cote d'Ivoire"},"2020-12-18",null,null,"2020-12-18",null,null,null,null,"X",null,null,"FF"]
[91,"WARA AIR SERVICE EUROPE","SWT551","ABJ",{"$f":"_xlfn.XLOOKUP(' Flight data base'!D92,'airport codes'!$D$3:$D$2103,'airport codes'!$C$3:$C$2103)","v":"Cote d'Ivoire"},"ACC",{"$f":"_xlfn.XLOOKUP(' Flight data base'!F92,'airport codes'!$D$3:$D$2103,'airport codes'!$C$3:$C$2103)","v":"Ghana"},"2020-12-18",null,null,"2020-12-18",null,null,null,null,"X",null,null,"FF"]
[92,"WARA AIR SERVICE EUROPE","SWT551","ACC",{"$f":"_xlfn.XLOOKUP(' Flight data base'!D93,'airport codes'!$D$3:$D$2103,'airport codes'!$C$3:$C$2103)","v":"Ghana"},"OUA",{"$f":"_xlfn.XLOOKUP(' Flight data base'!F93,'airport codes'!$D$3:$D$2103,'airport codes'!$C$3:$C$2103)","v":"Burkina Faso"},"2020-12-18",null,null,"2020-12-18",null,null,null,null,"X",null,null,"FF"]
[93,"WARA AIR SERVICE EUROPE","SWT551","OUA",{"$f":"_xlfn.XLOOKUP(' Flight data base'!D94,'airport codes'!$D$3:$D$2103,'airport codes'!$C$3:$C$2103)","v":"Burkina Faso"},"LGG",{"$f":"_xlfn.XLOOKUP(' Flight data base'!F94,'airport codes'!$D$3:$D$2103,'airport codes'!$C$3:$C$2103)","v":"Belgium"},"2020-12-18",null,null,"2020-12-18",null,null,null,null,"X",null,null,"FF"]
[94,"WARA AIR SERVICE EUROPE","SWT551","LGG",{"$f":"_xlfn.XLOOKUP(' Flight data base'!D95,'airport codes'!$D$3:$D$2103,'airport codes'!$C$3:$C$2103)","v":"Belgium"},"BKO",{"$f":"_xlfn.XLOOKUP(' Flight data base'!F95,'airport codes'!$D$3:$D$2103,'airport codes'!$C$3:$C$2103)","v":"Mali"},"2020-12-20",null,null,"2020-12-20",null,null,null,null,null,null,"X","FF"]
[95,"WARA AIR SERVICE EUROPE","SWT551","BKO",{"$f":"_xlfn.XLOOKUP(' Flight data base'!D96,'airport codes'!$D$3:$D$2103,'airport codes'!$C$3:$C$2103)","v":"Mali"},"OUA",{"$f":"_xlfn.XLOOKUP(' Flight data base'!F96,'airport codes'!$D$3:$D$2103,'airport codes'!$C$3:$C$2103)","v":"Burkina Faso"},"2020-12-20",null,null,"2020-12-20",null,null,null,null,null,null,"X","FF"]
[96,"WARA AIR SERVICE EUROPE","SWT551","OUA",{"$f":"_xlfn.XLOOKUP(' Flight data base'!D97,'airport codes'!$D$3:$D$2103,'airport codes'!$C$3:$C$2103)","v":"Burkina Faso"},"MAD",{"$f":"_xlfn.XLOOKUP(' Flight data base'!F97,'airport codes'!$D$3:$D$2103,'airport codes'!$C$3:$C$2103)","v":"Spain"},"2020-12-20",null,null,"2020-12-20",null,null,null,null,null,null,"X","FF"]
[97,"ASTRAL AVIATION","8V010","NBO",{"$f":"_xlfn.XLOOKUP(' Flight data base'!D98,'airport codes'!$D$3:$D$2103,'airport codes'!$C$3:$C$2103)","v":"Kenya"},"JNB",{"$f":"_xlfn.XLOOKUP(' Flight data base'!F98,'airport codes'!$D$3:$D$2103,'airport codes'!$C$3:$C$2103)","v":"South Africa"},"2020-12-01","2100","0100 +1",null,null,"X","X","X","X","X",null,"FF"]
[98,"ASTRAL AVIATION","8V045","NBO",{"$f":"_xlfn.XLOOKUP(' Flight data base'!D99,'airport codes'!$D$3:$D$2103,'airport codes'!$C$3:$C$2103)","v":"Kenya"},"LLW",{"$f":"_xlfn.XLOOKUP(' Flight data base'!F99,'airport codes'!$D$3:$D$2103,'airport codes'!$C$3:$C$2103)","v":"Malawi"},"2020-12-01","0800","1030",null,null,null,null,null,null,"X",null,"FF"]
[99,"ASTRAL AVIATION","8V040","NBO",{"$f":"_xlfn.XLOOKUP(' Flight data base'!D100,'airport codes'!$D$3:$D$2103,'airport codes'!$C$3:$C$2103)","v":"Kenya"},"LUN",{"$f":"_xlfn.XLOOKUP(' Flight data base'!F100,'airport codes'!$D$3:$D$2103,'airport codes'!$C$3:$C$2103)","v":"Zambia"},"2020-12-01","2100","0600 +1",null,null,null,"X","X",null,null,null,"FF"]
[100,"ASTRAL AVIATION","8V030","NBO",{"$f":"_xlfn.XLOOKUP(' Flight data base'!D101,'airport codes'!$D$3:$D$2103,'airport codes'!$C$3:$C$2103)","v":"Kenya"},"HGA",{"$f":"_xlfn.XLOOKUP(' Flight data base'!F101,'airport codes'!$D$3:$D$2103,'airport codes'!$C$3:$C$2103)","v":"Somalia"},"2020-12-01","0900","1100",null,null,null,null,null,null,null,"X","FF"]
[101,"ASTRAL AVIATION","8V035","NBO",{"$f":"_xlfn.XLOOKUP(' Flight data base'!D102,'airport codes'!$D$3:$D$2103,'airport codes'!$C$3:$C$2103)","v":"Kenya"},"BSA",{"$f":"_xlfn.XLOOKUP(' Flight data base'!F102,'airport codes'!$D$3:$D$2103,'airport codes'!$C$3:$C$2103)","v":"Somalia"},"2020-12-01","0700","1130",null,"X",null,null,null,null,null,null,"FF"]
[102,"ASTRAL AVIATION","8V015","NBO",{"$f":"_xlfn.XLOOKUP(' Flight data base'!D103,'airport codes'!$D$3:$D$2103,'airport codes'!$C$3:$C$2103)","v":"Kenya"},"KMU",{"$f":"_xlfn.XLOOKUP(' Flight data base'!F103,'airport codes'!$D$3:$D$2103,'airport codes'!$C$3:$C$2103)","v":"Somalia"},"2020-12-01","0700","1100",null,"X",null,null,null,null,null,null,"FF"]
[103,"ASTRAL AVIATION",null,"NBO",{"$f":"_xlfn.XLOOKUP(' Flight data base'!D104,'airport codes'!$D$3:$D$2103,'airport codes'!$C$3:$C$2103)","v":"Kenya"},"DSA",{"$f":"_xlfn.XLOOKUP(' Flight data base'!F104,'airport codes'!$D$3:$D$2103,'airport codes'!$C$3:$C$2103)","v":"United Kingdom"},"2020-12-01","0130",null,null,"X",null,null,null,null,null,"X","FF"]
[104,"ASTRAL AVIATION","8V080","NBO",{"$f":"_xlfn.XLOOKUP(' Flight data base'!D105,'airport codes'!$D$3:$D$2103,'airport codes'!$C$3:$C$2103)","v":"Kenya"},"JUB",{"$f":"_xlfn.XLOOKUP(' Flight data base'!F105,'airport codes'!$D$3:$D$2103,'airport codes'!$C$3:$C$2103)","v":"South Sudan"},"2020-12-01","800","0930",null,null,"X",null,"X",null,null,null,"FF"]
[105,"ASTRAL AVIATION","8V025","NBO",{"$f":"_xlfn.XLOOKUP(' Flight data base'!D106,'airport codes'!$D$3:$D$2103,'airport codes'!$C$3:$C$2103)","v":"Kenya"},"MWZ",{"$f":"_xlfn.XLOOKUP(' Flight data base'!F106,'airport codes'!$D$3:$D$2103,'airport codes'!$C$3:$C$2103)","v":"Tanzania"},"2020-12-01","1400","1450",null,null,"X",null,null,null,null,"X","FF"]
[106,"ASTRAL AVIATION","8V005","NBO",{"$f":"_xlfn.XLOOKUP(' Flight data base'!D107,'airport codes'!$D$3:$D$2103,'airport codes'!$C$3:$C$2103)","v":"Kenya"},"MGQ",{"$f":"_xlfn.XLOOKUP(' Flight data base'!F107,'airport codes'!$D$3:$D$2103,'airport codes'!$C$3:$C$2103)","v":"Somalia"},"2020-12-01","0700","0820",null,null,null,"X",null,null,null,"X","FF"]
[107,"ASTRAL AVIATION","8V050","NBO",{"$f":"_xlfn.XLOOKUP(' Flight data base'!D108,'airport codes'!$D$3:$D$2103,'airport codes'!$C$3:$C$2103)","v":"Kenya"},"DAR",{"$f":"_xlfn.XLOOKUP(' Flight data base'!F108,'airport codes'!$D$3:$D$2103,'airport codes'!$C$3:$C$2103)","v":"Tanzania"},"2020-12-01","1400","1500",null,null,null,"X",null,null,"X",null,"FF"]
[108,"ASTRAL AVIATION","8V905","NBO",{"$f":"_xlfn.XLOOKUP(' Flight data base'!D109,'airport codes'!$D$3:$D$2103,'airport codes'!$C$3:$C$2103)","v":"Kenya"},"JIB",{"$f":"_xlfn.XLOOKUP(' Flight data base'!F109,'airport codes'!$D$3:$D$2103,'airport codes'!$C$3:$C$2103)","v":"Djibouti"},"2020-12-01","1200","1400",null,null,null,null,null,null,null,"X","FF"]
[109,"ASTRAL AVIATION","8V010","NBO",{"$f":"_xlfn.XLOOKUP(' Flight data base'!D110,'airport codes'!$D$3:$D$2103,'airport codes'!$C$3:$C$2103)","v":"Kenya"},"EBB",{"$f":"_xlfn.XLOOKUP(' Flight data base'!F110,'airport codes'!$D$3:$D$2103,'airport codes'!$C$3:$C$2103)","v":"Uganda"},"2020-12-01","0900","1000",null,null,null,null,"X",null,null,null,"FF"]
[110,"ASTRAL AVIATION","8V060","NBO",{"$f":"_xlfn.XLOOKUP(' Flight data base'!D111,'airport codes'!$D$3:$D$2103,'airport codes'!$C$3:$C$2103)","v":"Kenya"},"ZNZ",{"$f":"_xlfn.XLOOKUP(' Flight data base'!F111,'airport codes'!$D$3:$D$2103,'airport codes'!$C$3:$C$2103)","v":"Tanzania"},"2020-12-01","0800","0900",null,null,null,null,null,null,"X",null,"FF"]
[111,"ASTRAL AVIATION","8V090","NBO",{"$f":"_xlfn.XLOOKUP(' Flight data base'!D112,'airport codes'!$D$3:$D$2103,'airport codes'!$C$3:$C$2103)","v":"Kenya"},"POL",{"$f":"_xlfn.XLOOKUP(' Flight data base'!F112,'airport codes'!$D$3:$D$2103,'airport codes'!$C$3:$C$2103)","v":"Mozambique"},"2020-12-01","0800","1100",null,null,null,null,"X",null,null,null,"FF"]
[112,"ASTRAL AVIATION","8V090","NBO",{"$f":"_xlfn.XLOOKUP(' Flight data base'!D113,'airport codes'!$D$3:$D$2103,'airport codes'!$C$3:$C$2103)","v":"Kenya"},"MPM",{"$f":"_xlfn.XLOOKUP(' Flight data base'!F113,'airport codes'!$D$3:$D$2103,'airport codes'!$C$3:$C$2103)","v":"Mozambique"},"2020-12-01","2100","0600 +1",null,null,null,null,null,null,"X",null,"FF"]
[113,"ASTRAL AVIATION",null,"NBO",{"$f":"_xlfn.XLOOKUP(' Flight data base'!D114,'airport codes'!$D$3:$D$2103,'airport codes'!$C$3:$C$2103)","v":"Kenya"},"LGG",{"$f":"_xlfn.XLOOKUP(' Flight data base'!F114,'airport codes'!$D$3:$D$2103,'airport codes'!$C$3:$C$2103)","v":"Belgium"},"2020-12-01","0130",null,null,null,"X",null,"X",null,null,"X","FF"]
[114,"Lufthansa","LH1323","TUN",{"$f":"_xlfn.XLOOKUP(' Flight data base'!D115,'airport codes'!$D$3:$D$2103,'airport codes'!$C$3:$C$2103)","v":"Tunisia"},"FRA",{"$f":"_xlfn.XLOOKUP(' Flight data base'!F115,'airport codes'!$D$3:$D$2103,'airport codes'!$C$3:$C$2103)","v":"Germany"},"28DEC20",1250,1520,"2021-01-04","X",null,null,null,null,null,null,"PAXULD"]
[115,"Lufthansa","LH1323","TUN",{"$f":"_xlfn.XLOOKUP(' Flight data base'!D116,'airport codes'!$D$3:$D$2103,'airport codes'!$C$3:$C$2103)","v":"Tunisia"},"FRA",{"$f":"_xlfn.XLOOKUP(' Flight data base'!F116,'airport codes'!$D$3:$D$2103,'airport codes'!$C$3:$C$2103)","v":"Germany"},"21DEC20",1250,1520,"21DEC20","X",null,null,null,null,null,null,"Others"]
[116,"Lufthansa","LH1323","TUN",{"$f":"_xlfn.XLOOKUP(' Flight data base'!D117,'airport codes'!$D$3:$D$2103,'airport codes'!$C$3:$C$2103)","v":"Tunisia"},"FRA",{"$f":"_xlfn.XLOOKUP(' Flight data base'!F117,'airport codes'!$D$3:$D$2103,'airport codes'!$C$3:$C$2103)","v":"Germany"},"2021-01-11",1250,1520,"2021-01-11","X",null,null,null,null,null,null,"PAXULD"]
[117,"Lufthansa","LH1316","FRA",{"$f":"_xlfn.XLOOKUP(' Flight data base'!D118,'airport codes'!$D$3:$D$2103,'airport codes'!$C$3:$C$2103)","v":"Germany"},"ALG",{"$f":"_xlfn.XLOOKUP(' Flight data base'!F118,'airport codes'!$D$3:$D$2103,'airport codes'!$C$3:$C$2103)","v":"Algeria"},"18DEC20",1000,1235,"18DEC20",null,null,null,null,"X",null,null,"PAXULD"]
[118,"Lufthansa","LH1316","FRA",{"$f":"_xlfn.XLOOKUP(' Flight data base'!D119,'airport codes'!$D$3:$D$2103,'airport codes'!$C$3:$C$2103)","v":"Germany"},"ALG",{"$f":"_xlfn.XLOOKUP(' Flight data base'!F119,'airport codes'!$D$3:$D$2103,'airport codes'!$C$3:$C$2103)","v":"Algeria"},"2021-01-07",1000,1235,"2021-01-07",null,null,null,"X",null,null,null,"PAXULD"]
[119,"Lufthansa","LH1322","FRA",{"$f":"_xlfn.XLOOKUP(' Flight data base'!D120,'airport codes'!$D$3:$D$2103,'airport codes'!$C$3:$C$2103)","v":"Germany"},"TUN",{"$f":"_xlfn.XLOOKUP(' Flight data base'!F120,'airport codes'!$D$3:$D$2103,'airport codes'!$C$3:$C$2103)","v":"Tunisia"},"28DEC20",935,1155,"2021-01-25","X",null,null,null,null,null,null,"PAXULD"]
[120,"Lufthansa","LH1322","FRA",{"$f":"_xlfn.XLOOKUP(' Flight data base'!D121,'airport codes'!$D$3:$D$2103,'airport codes'!$C$3:$C$2103)","v":"Germany"},"TUN",{"$f":"_xlfn.XLOOKUP(' Flight data base'!F121,'airport codes'!$D$3:$D$2103,'airport codes'!$C$3:$C$2103)","v":"Tunisia"},"21DEC20",935,1155,"21DEC20","X",null,null,null,null,null,null,"Others"]
[121,"Lufthansa","LH1326","FRA",{"$f":"_xlfn.XLOOKUP(' Flight data base'!D122,'airport codes'!$D$3:$D$2103,'airport codes'!$C$3:$C$2103)","v":"Germany"},"TUN",{"$f":"_xlfn.XLOOKUP(' Flight data base'!F122,'airport codes'!$D$3:$D$2103,'airport codes'!$C$3:$C$2103)","v":"Tunisia"},"16DEC20",2205,25,"16DEC20",null,null,"X",null,null,null,null,"PAXULD"]
[122,"Lufthansa","LH1326","FRA",{"$f":"_xlfn.XLOOKUP(' Flight data base'!D123,'airport codes'!$D$3:$D$2103,'airport codes'!$C$3:$C$2103)","v":"Germany"},"TUN",{"$f":"_xlfn.XLOOKUP(' Flight data base'!F123,'airport codes'!$D$3:$D$2103,'airport codes'!$C$3:$C$2103)","v":"Tunisia"},"19DEC20",2205,25,"26DEC20",null,null,null,null,null,"X",null,"PAXULD"]
[123,"Lufthansa","LH1326","FRA",{"$f":"_xlfn.XLOOKUP(' Flight data base'!D124,'airport codes'!$D$3:$D$2103,'airport codes'!$C$3:$C$2103)","v":"Germany"},"TUN",{"$f":"_xlfn.XLOOKUP(' Flight data base'!F124,'airport codes'!$D$3:$D$2103,'airport codes'!$C$3:$C$2103)","v":"Tunisia"},"23DEC20",2205,25,"23DEC20",null,null,"X",null,null,null,null,"PAXULD"]
[124,"Lufthansa","LH1326","FRA",{"$f":"_xlfn.XLOOKUP(' Flight data base'!D125,'airport codes'!$D$3:$D$2103,'airport codes'!$C$3:$C$2103)","v":"Germany"},"TUN",{"$f":"_xlfn.XLOOKUP(' Flight data base'!F125,'airport codes'!$D$3:$D$2103,'airport codes'!$C$3:$C$2103)","v":"Tunisia"},"30DEC20",2205,25,"30DEC20",null,null,"X",null,null,null,null,"Others"]
[125,"Lufthansa","LH1326","FRA",{"$f":"_xlfn.XLOOKUP(' Flight data base'!D126,'airport codes'!$D$3:$D$2103,'airport codes'!$C$3:$C$2103)","v":"Germany"},"TUN",{"$f":"_xlfn.XLOOKUP(' Flight data base'!F126,'airport codes'!$D$3:$D$2103,'airport codes'!$C$3:$C$2103)","v":"Tunisia"},"2021-01-02",2205,25,"2021-01-02",null,null,null,null,null,"X",null,"PAXULD"]
[126,"Lufthansa","LH1326","FRA",{"$f":"_xlfn.XLOOKUP(' Flight data base'!D127,'airport codes'!$D$3:$D$2103,'airport codes'!$C$3:$C$2103)","v":"Germany"},"TUN",{"$f":"_xlfn.XLOOKUP(' Flight data base'!F127,'airport codes'!$D$3:$D$2103,'airport codes'!$C$3:$C$2103)","v":"Tunisia"},"2021-01-06",2205,25,"2021-01-06",null,null,"X",null,null,null,null,"PAXULD"]
[127,"Lufthansa","LH1326","FRA",{"$f":"_xlfn.XLOOKUP(' Flight data base'!D128,'airport codes'!$D$3:$D$2103,'airport codes'!$C$3:$C$2103)","v":"Germany"},"TUN",{"$f":"_xlfn.XLOOKUP(' Flight data base'!F128,'airport codes'!$D$3:$D$2103,'airport codes'!$C$3:$C$2103)","v":"Tunisia"},"2021-01-09",2205,25,"2021-03-20",null,null,null,null,null,"X",null,"PAXULD"]
[128,"Lufthansa","LH1326","FRA",{"$f":"_xlfn.XLOOKUP(' Flight data base'!D129,'airport codes'!$D$3:$D$2103,'airport codes'!$C$3:$C$2103)","v":"Germany"},"TUN",{"$f":"_xlfn.XLOOKUP(' Flight data base'!F129,'airport codes'!$D$3:$D$2103,'airport codes'!$C$3:$C$2103)","v":"Tunisia"},"2021-01-13",2205,25,"2021-03-24",null,null,"X",null,null,null,null,"PAXULD"]
[129,"Lufthansa","LH560","FRA",{"$f":"_xlfn.XLOOKUP(' Flight data base'!D130,'airport codes'!$D$3:$D$2103,'airport codes'!$C$3:$C$2103)","v":"Germany"},"LAD",{"$f":"_xlfn.XLOOKUP(' Flight data base'!F130,'airport codes'!$D$3:$D$2103,'airport codes'!$C$3:$C$2103)","v":"Angola"},"20DEC20",2150,625,"20DEC20",null,null,null,null,null,null,"X","PAXULD"]
[130,"Lufthansa","LH560","FRA",{"$f":"_xlfn.XLOOKUP(' Flight data base'!D131,'airport codes'!$D$3:$D$2103,'airport codes'!$C$3:$C$2103)","v":"Germany"},"LAD",{"$f":"_xlfn.XLOOKUP(' Flight data base'!F131,'airport codes'!$D$3:$D$2103,'airport codes'!$C$3:$C$2103)","v":"Angola"},"27DEC20",2150,625,"27DEC20",null,null,null,null,null,null,"X","PAXULD"]
[131,"Lufthansa","LH560","FRA",{"$f":"_xlfn.XLOOKUP(' Flight data base'!D132,'airport codes'!$D$3:$D$2103,'airport codes'!$C$3:$C$2103)","v":"Germany"},"LAD",{"$f":"_xlfn.XLOOKUP(' Flight data base'!F132,'airport codes'!$D$3:$D$2103,'airport codes'!$C$3:$C$2103)","v":"Angola"},"2021-01-03",2150,625,"2021-01-03",null,null,null,null,null,null,"X","PAXULD"]
[132,"Lufthansa","LH560","FRA",{"$f":"_xlfn.XLOOKUP(' Flight data base'!D133,'airport codes'!$D$3:$D$2103,'airport codes'!$C$3:$C$2103)","v":"Germany"},"LAD",{"$f":"_xlfn.XLOOKUP(' Flight data base'!F133,'airport codes'!$D$3:$D$2103,'airport codes'!$C$3:$C$2103)","v":"Angola"},"2021-01-10",2150,625,"2021-03-21",null,null,null,null,null,null,"X","PAXULD"]
[133,"Lufthansa","LH560","FRA",{"$f":"_xlfn.XLOOKUP(' Flight data base'!D134,'airport codes'!$D$3:$D$2103,'airport codes'!$C$3:$C$2103)","v":"Germany"},"LAD",{"$f":"_xlfn.XLOOKUP(' Flight data base'!F134,'airport codes'!$D$3:$D$2103,'airport codes'!$C$3:$C$2103)","v":"Angola"},"15DEC20",2150,625,"15DEC20",null,"X",null,null,null,null,null,"PAXULD"]
[134,"Lufthansa","LH560","FRA",{"$f":"_xlfn.XLOOKUP(' Flight data base'!D135,'airport codes'!$D$3:$D$2103,'airport codes'!$C$3:$C$2103)","v":"Germany"},"LAD",{"$f":"_xlfn.XLOOKUP(' Flight data base'!F135,'airport codes'!$D$3:$D$2103,'airport codes'!$C$3:$C$2103)","v":"Angola"},"22DEC20",2150,625,"2021-03-23",null,"X",null,null,null,null,null,"PAXULD"]
[135,"Lufthansa","LH568","FRA",{"$f":"_xlfn.XLOOKUP(' Flight data base'!D136,'airport codes'!$D$3:$D$2103,'airport codes'!$C$3:$C$2103)","v":"Germany"},"SSG",{"$f":"_xlfn.XLOOKUP(' Flight data base'!F136,'airport codes'!$D$3:$D$2103,'airport codes'!$C$3:$C$2103)","v":"Equatorial Guinea"},"26DEC20",1105,1950,"26DEC20",null,null,null,null,null,"X",null,"PAXULD"]
[136,"Lufthansa","LH568","FRA",{"$f":"_xlfn.XLOOKUP(' Flight data base'!D137,'airport codes'!$D$3:$D$2103,'airport codes'!$C$3:$C$2103)","v":"Germany"},"LOS",{"$f":"_xlfn.XLOOKUP(' Flight data base'!F137,'airport codes'!$D$3:$D$2103,'airport codes'!$C$3:$C$2103)","v":"Nigeria"},"26DEC20",1105,1740,"26DEC20",null,null,null,null,null,"X",null,"PAXULD"]
[137,"Lufthansa","LH568","FRA",{"$f":"_xlfn.XLOOKUP(' Flight data base'!D138,'airport codes'!$D$3:$D$2103,'airport codes'!$C$3:$C$2103)","v":"Germany"},"SSG",{"$f":"_xlfn.XLOOKUP(' Flight data base'!F138,'airport codes'!$D$3:$D$2103,'airport codes'!$C$3:$C$2103)","v":"Equatorial Guinea"},"28DEC20",1105,1950,"30DEC20","X",null,"X",null,null,null,null,"PAXULD"]
[138,"Lufthansa","LH568","FRA",{"$f":"_xlfn.XLOOKUP(' Flight data base'!D139,'airport codes'!$D$3:$D$2103,'airport codes'!$C$3:$C$2103)","v":"Germany"},"LOS",{"$f":"_xlfn.XLOOKUP(' Flight data base'!F139,'airport codes'!$D$3:$D$2103,'airport codes'!$C$3:$C$2103)","v":"Nigeria"},"28DEC20",1105,1740,"30DEC20","X",null,"X",null,null,null,null,"PAXULD"]
[139,"Lufthansa","LH568","FRA",{"$f":"_xlfn.XLOOKUP(' Flight data base'!D140,'airport codes'!$D$3:$D$2103,'airport codes'!$C$3:$C$2103)","v":"Germany"},"SSG",{"$f":"_xlfn.XLOOKUP(' Flight data base'!F140,'airport codes'!$D$3:$D$2103,'airport codes'!$C$3:$C$2103)","v":"Equatorial Guinea"},"2021-01-02",1105,1950,"2021-01-02",null,null,null,null,null,"X",null,"PAXULD"]
[140,"Lufthansa","LH568","FRA",{"$f":"_xlfn.XLOOKUP(' Flight data base'!D141,'airport codes'!$D$3:$D$2103,'airport codes'!$C$3:$C$2103)","v":"Germany"},"LOS",{"$f":"_xlfn.XLOOKUP(' Flight data base'!F141,'airport codes'!$D$3:$D$2103,'airport codes'!$C$3:$C$2103)","v":"Nigeria"},"2021-01-02",1105,1740,"2021-01-02",null,null,null,null,null,"X",null,"PAXULD"]
[141,"Lufthansa","LH568","FRA",{"$f":"_xlfn.XLOOKUP(' Flight data base'!D142,'airport codes'!$D$3:$D$2103,'airport codes'!$C$3:$C$2103)","v":"Germany"},"SSG",{"$f":"_xlfn.XLOOKUP(' Flight data base'!F142,'airport codes'!$D$3:$D$2103,'airport codes'!$C$3:$C$2103)","v":"Equatorial Guinea"},"2021-01-04",1105,1950,"2021-01-06","X",null,"X",null,null,null,null,"PAXULD"]
[142,"Lufthansa","LH568","FRA",{"$f":"_xlfn.XLOOKUP(' Flight data base'!D143,'airport codes'!$D$3:$D$2103,'airport codes'!$C$3:$C$2103)","v":"Germany"},"LOS",{"$f":"_xlfn.XLOOKUP(' Flight data base'!F143,'airport codes'!$D$3:$D$2103,'airport codes'!$C$3:$C$2103)","v":"Nigeria"},"2021-01-04",1105,1740,"2021-01-06","X",null,"X",null,null,null,null,"PAXULD"]
[143,"Lufthansa","LH568","FRA",{"$f":"_xlfn.XLOOKUP(' Flight data base'!D144,'airport codes'!$D$3:$D$2103,'airport codes'!$C$3:$C$2103)","v":"Germany"},"SSG",{"$f":"_xlfn.XLOOKUP(' Flight data base'!F144,'airport codes'!$D$3:$D$2103,'airport codes'!$C$3:$C$2103)","v":"Equatorial Guinea"},"2021-01-07",1105,1950,"2021-01-15","X",null,"X","X","X",null,null,"PAXULD"]
[144,"Lufthansa","LH568","FRA",{"$f":"_xlfn.XLOOKUP(' Flight data base'!D145,'airport codes'!$D$3:$D$2103,'airport codes'!$C$3:$C$2103)","v":"Germany"},"LOS",{"$f":"_xlfn.XLOOKUP(' Flight data base'!F145,'airport codes'!$D$3:$D$2103,'airport codes'!$C$3:$C$2103)","v":"Nigeria"},"2021-01-07",1105,1740,"2021-01-15","X",null,"X","X","X",null,null,"PAXULD"]
[145,"Lufthansa","LH568","FRA",{"$f":"_xlfn.XLOOKUP(' Flight data base'!D146,'airport codes'!$D$3:$D$2103,'airport codes'!$C$3:$C$2103)","v":"Germany"},"SSG",{"$f":"_xlfn.XLOOKUP(' Flight data base'!F146,'airport codes'!$D$3:$D$2103,'airport codes'!$C$3:$C$2103)","v":"Equatorial Guinea"},"2021-01-09",1105,1950,"2021-01-09",null,null,null,null,null,"X",null,"PAXULD"]
[146,"Lufthansa","LH568","FRA",{"$f":"_xlfn.XLOOKUP(' Flight data base'!D147,'airport codes'!$D$3:$D$2103,'airport codes'!$C$3:$C$2103)","v":"Germany"},"LOS",{"$f":"_xlfn.XLOOKUP(' Flight data base'!F147,'airport codes'!$D$3:$D$2103,'airport codes'!$C$3:$C$2103)","v":"Nigeria"},"2021-01-09",1105,1740,"2021-01-09",null,null,null,null,null,"X",null,"PAXULD"]
[147,"Lufthansa","LH568","FRA",{"$f":"_xlfn.XLOOKUP(' Flight data base'!D148,'airport codes'!$D$3:$D$2103,'airport codes'!$C$3:$C$2103)","v":"Germany"},"SSG",{"$f":"_xlfn.XLOOKUP(' Flight data base'!F148,'airport codes'!$D$3:$D$2103,'airport codes'!$C$3:$C$2103)","v":"Equatorial Guinea"},"16DEC20",1105,1950,"16DEC20",null,null,"X",null,null,null,null,"PAXULD"]
[148,"Lufthansa","LH568","FRA",{"$f":"_xlfn.XLOOKUP(' Flight data base'!D149,'airport codes'!$D$3:$D$2103,'airport codes'!$C$3:$C$2103)","v":"Germany"},"LOS",{"$f":"_xlfn.XLOOKUP(' Flight data base'!F149,'airport codes'!$D$3:$D$2103,'airport codes'!$C$3:$C$2103)","v":"Nigeria"},"16DEC20",1105,1740,"16DEC20",null,null,"X",null,null,null,null,"PAXULD"]
[149,"Lufthansa","LH568","FRA",{"$f":"_xlfn.XLOOKUP(' Flight data base'!D150,'airport codes'!$D$3:$D$2103,'airport codes'!$C$3:$C$2103)","v":"Germany"},"SSG",{"$f":"_xlfn.XLOOKUP(' Flight data base'!F150,'airport codes'!$D$3:$D$2103,'airport codes'!$C$3:$C$2103)","v":"Equatorial Guinea"},"2021-01-10",1105,1950,"2021-01-10",null,null,null,null,null,null,"X","PAXULD"]
[150,"Lufthansa","LH568","FRA",{"$f":"_xlfn.XLOOKUP(' Flight data base'!D151,'airport codes'!$D$3:$D$2103,'airport codes'!$C$3:$C$2103)","v":"Germany"},"LOS",{"$f":"_xlfn.XLOOKUP(' Flight data base'!F151,'airport codes'!$D$3:$D$2103,'airport codes'!$C$3:$C$2103)","v":"Nigeria"},"2021-01-10",1105,1740,"2021-01-10",null,null,null,null,null,null,"X","PAXULD"]
[151,"Lufthansa","LH568","FRA",{"$f":"_xlfn.XLOOKUP(' Flight data base'!D152,'airport codes'!$D$3:$D$2103,'airport codes'!$C$3:$C$2103)","v":"Germany"},"SSG",{"$f":"_xlfn.XLOOKUP(' Flight data base'!F152,'airport codes'!$D$3:$D$2103,'airport codes'!$C$3:$C$2103)","v":"Equatorial Guinea"},"17DEC20",1105,1950,"17DEC20",null,null,null,"X",null,null,null,"PAXULD"]
[152,"Lufthansa","LH568","FRA",{"$f":"_xlfn.XLOOKUP(' Flight data base'!D153,'airport codes'!$D$3:$D$2103,'airport codes'!$C$3:$C$2103)","v":"Germany"},"LOS",{"$f":"_xlfn.XLOOKUP(' Flight data base'!F153,'airport codes'!$D$3:$D$2103,'airport codes'!$C$3:$C$2103)","v":"Nigeria"},"17DEC20",1105,1740,"17DEC20",null,null,null,"X",null,null,null,"PAXULD"]
[153,"Lufthansa","LH568","FRA",{"$f":"_xlfn.XLOOKUP(' Flight data base'!D154,'airport codes'!$D$3:$D$2103,'airport codes'!$C$3:$C$2103)","v":"Germany"},"SSG",{"$f":"_xlfn.XLOOKUP(' Flight data base'!F154,'airport codes'!$D$3:$D$2103,'airport codes'!$C$3:$C$2103)","v":"Equatorial Guinea"},"18DEC20",1105,1950,"18DEC20",null,null,null,null,"X",null,null,"PAXULD"]
[154,"Lufthansa","LH568","FRA",{"$f":"_xlfn.XLOOKUP(' Flight data base'!D155,'airport codes'!$D$3:$D$2103,'airport codes'!$C$3:$C$2103)","v":"Germany"},"LOS",{"$f":"_xlfn.XLOOKUP(' Flight data base'!F155,'airport codes'!$D$3:$D$2103,'airport codes'!$C$3:$C$2103)","v":"Nigeria"},"18DEC20",1105,1740,"18DEC20",null,null,null,null,"X",null,null,"PAXULD"]
[155,"Lufthansa","LH568","FRA",{"$f":"_xlfn.XLOOKUP(' Flight data base'!D156,'airport codes'!$D$3:$D$2103,'airport codes'!$C$3:$C$2103)","v":"Germany"},"SSG",{"$f":"_xlfn.XLOOKUP(' Flight data base'!F156,'airport codes'!$D$3:$D$2103,'airport codes'!$C$3:$C$2103)","v":"Equatorial Guinea"},"19DEC20",1105,1950,"23DEC20","X",null,"X",null,null,"X",null,"PAXULD"]
[156,"Lufthansa","LH568","FRA",{"$f":"_xlfn.XLOOKUP(' Flight data base'!D157,'airport codes'!$D$3:$D$2103,'airport codes'!$C$3:$C$2103)","v":"Germany"},"LOS",{"$f":"_xlfn.XLOOKUP(' Flight data base'!F157,'airport codes'!$D$3:$D$2103,'airport codes'!$C$3:$C$2103)","v":"Nigeria"},"19DEC20",1105,1740,"23DEC20","X",null,"X",null,null,"X",null,"PAXULD"]
[157,"Lufthansa","LH572","FRA",{"$f":"_xlfn.XLOOKUP(' Flight data base'!D158,'airport codes'!$D$3:$D$2103,'airport codes'!$C$3:$C$2103)","v":"Germany"},"JNB",{"$f":"_xlfn.XLOOKUP(' Flight data base'!F158,'airport codes'!$D$3:$D$2103,'airport codes'!$C$3:$C$2103)","v":"South Africa"},"20DEC20",2200,925,"22DEC20",null,"X",null,null,null,null,"X","PAXULD"]
[158,"Lufthansa","LH572","FRA",{"$f":"_xlfn.XLOOKUP(' Flight data base'!D159,'airport codes'!$D$3:$D$2103,'airport codes'!$C$3:$C$2103)","v":"Germany"},"JNB",{"$f":"_xlfn.XLOOKUP(' Flight data base'!F159,'airport codes'!$D$3:$D$2103,'airport codes'!$C$3:$C$2103)","v":"South Africa"},"25DEC20",2200,925,"25DEC20",null,null,null,null,"X",null,null,"PAXULD"]
[159,"Lufthansa","LH572","FRA",{"$f":"_xlfn.XLOOKUP(' Flight data base'!D160,'airport codes'!$D$3:$D$2103,'airport codes'!$C$3:$C$2103)","v":"Germany"},"JNB",{"$f":"_xlfn.XLOOKUP(' Flight data base'!F160,'airport codes'!$D$3:$D$2103,'airport codes'!$C$3:$C$2103)","v":"South Africa"},"27DEC20",2200,925,"29DEC20",null,"X",null,null,null,null,"X","PAXULD"]
[160,"Lufthansa","LH572","FRA",{"$f":"_xlfn.XLOOKUP(' Flight data base'!D161,'airport codes'!$D$3:$D$2103,'airport codes'!$C$3:$C$2103)","v":"Germany"},"JNB",{"$f":"_xlfn.XLOOKUP(' Flight data base'!F161,'airport codes'!$D$3:$D$2103,'airport codes'!$C$3:$C$2103)","v":"South Africa"},"2021-01-01",2200,925,"2021-01-01",null,null,null,null,"X",null,null,"PAXULD"]
[161,"Lufthansa","LH572","FRA",{"$f":"_xlfn.XLOOKUP(' Flight data base'!D162,'airport codes'!$D$3:$D$2103,'airport codes'!$C$3:$C$2103)","v":"Germany"},"JNB",{"$f":"_xlfn.XLOOKUP(' Flight data base'!F162,'airport codes'!$D$3:$D$2103,'airport codes'!$C$3:$C$2103)","v":"South Africa"},"2021-01-02",2200,925,"27FEB21",null,null,null,"X",null,"X",null,"PAXULD"]
[162,"Lufthansa","LH572","FRA",{"$f":"_xlfn.XLOOKUP(' Flight data base'!D163,'airport codes'!$D$3:$D$2103,'airport codes'!$C$3:$C$2103)","v":"Germany"},"JNB",{"$f":"_xlfn.XLOOKUP(' Flight data base'!F163,'airport codes'!$D$3:$D$2103,'airport codes'!$C$3:$C$2103)","v":"South Africa"},"26DEC20",2200,925,"26DEC20",null,null,null,null,null,"X",null,"PAXULD"]
[163,"Lufthansa","LH572","FRA",{"$f":"_xlfn.XLOOKUP(' Flight data base'!D164,'airport codes'!$D$3:$D$2103,'airport codes'!$C$3:$C$2103)","v":"Germany"},"JNB",{"$f":"_xlfn.XLOOKUP(' Flight data base'!F164,'airport codes'!$D$3:$D$2103,'airport codes'!$C$3:$C$2103)","v":"South Africa"},"2021-01-03",2200,925,"2021-01-05",null,"X",null,null,null,null,"X","PAXULD"]
[164,"Lufthansa","LH572","FRA",{"$f":"_xlfn.XLOOKUP(' Flight data base'!D165,'airport codes'!$D$3:$D$2103,'airport codes'!$C$3:$C$2103)","v":"Germany"},"JNB",{"$f":"_xlfn.XLOOKUP(' Flight data base'!F165,'airport codes'!$D$3:$D$2103,'airport codes'!$C$3:$C$2103)","v":"South Africa"},"17DEC20",2200,925,"19DEC20",null,null,null,"X",null,"X",null,"PAXULD"]
[165,"Lufthansa","LH572","FRA",{"$f":"_xlfn.XLOOKUP(' Flight data base'!D166,'airport codes'!$D$3:$D$2103,'airport codes'!$C$3:$C$2103)","v":"Germany"},"JNB",{"$f":"_xlfn.XLOOKUP(' Flight data base'!F166,'airport codes'!$D$3:$D$2103,'airport codes'!$C$3:$C$2103)","v":"South Africa"},"2021-01-08",2200,925,"26FEB21",null,"X",null,null,"X",null,"X","PAXULD"]
[166,"Lufthansa","LH572","FRA",{"$f":"_xlfn.XLOOKUP(' Flight data base'!D167,'airport codes'!$D$3:$D$2103,'airport codes'!$C$3:$C$2103)","v":"Germany"},"JNB",{"$f":"_xlfn.XLOOKUP(' Flight data base'!F167,'airport codes'!$D$3:$D$2103,'airport codes'!$C$3:$C$2103)","v":"South Africa"},"18DEC20",2200,925,"18DEC20",null,null,null,null,"X",null,null,"PAXULD"]
[167,"Lufthansa","LH572","FRA",{"$f":"_xlfn.XLOOKUP(' Flight data base'!D168,'airport codes'!$D$3:$D$2103,'airport codes'!$C$3:$C$2103)","v":"Germany"},"JNB",{"$f":"_xlfn.XLOOKUP(' Flight data base'!F168,'airport codes'!$D$3:$D$2103,'airport codes'!$C$3:$C$2103)","v":"South Africa"},"15DEC20",2200,925,"15DEC20",null,"X",null,null,null,null,null,"PAXULD"]
[168,"Lufthansa","LH574","MUC",{"$f":"_xlfn.XLOOKUP(' Flight data base'!D169,'airport codes'!$D$3:$D$2103,'airport codes'!$C$3:$C$2103)","v":"Germany"},"CPT",{"$f":"_xlfn.XLOOKUP(' Flight data base'!F169,'airport codes'!$D$3:$D$2103,'airport codes'!$C$3:$C$2103)","v":"South Africa"},"2021-01-14",2225,1040,"2021-03-25",null,"X",null,"X",null,null,"X","PAXULD"]
[169,"Lufthansa","LH574","MUC",{"$f":"_xlfn.XLOOKUP(' Flight data base'!D170,'airport codes'!$D$3:$D$2103,'airport codes'!$C$3:$C$2103)","v":"Germany"},"CPT",{"$f":"_xlfn.XLOOKUP(' Flight data base'!F170,'airport codes'!$D$3:$D$2103,'airport codes'!$C$3:$C$2103)","v":"South Africa"},"15DEC20",2225,1035,"17DEC20",null,"X",null,"X",null,null,null,"PAXULD"]
[170,"Lufthansa","LH574","MUC",{"$f":"_xlfn.XLOOKUP(' Flight data base'!D171,'airport codes'!$D$3:$D$2103,'airport codes'!$C$3:$C$2103)","v":"Germany"},"CPT",{"$f":"_xlfn.XLOOKUP(' Flight data base'!F171,'airport codes'!$D$3:$D$2103,'airport codes'!$C$3:$C$2103)","v":"South Africa"},"27DEC20",2225,1035,"27DEC20",null,null,null,null,null,null,"X","PAXULD"]
[171,"Lufthansa","LH574","MUC",{"$f":"_xlfn.XLOOKUP(' Flight data base'!D172,'airport codes'!$D$3:$D$2103,'airport codes'!$C$3:$C$2103)","v":"Germany"},"CPT",{"$f":"_xlfn.XLOOKUP(' Flight data base'!F172,'airport codes'!$D$3:$D$2103,'airport codes'!$C$3:$C$2103)","v":"South Africa"},"21DEC20",2225,1035,"23DEC20","X",null,"X",null,null,null,null,"PAXULD"]
[172,"Lufthansa","LH574","MUC",{"$f":"_xlfn.XLOOKUP(' Flight data base'!D173,'airport codes'!$D$3:$D$2103,'airport codes'!$C$3:$C$2103)","v":"Germany"},"CPT",{"$f":"_xlfn.XLOOKUP(' Flight data base'!F173,'airport codes'!$D$3:$D$2103,'airport codes'!$C$3:$C$2103)","v":"South Africa"},"22DEC20",2225,1035,"22DEC20",null,"X",null,null,null,null,null,"PAXULD"]
[173,"Lufthansa","LH574","MUC",{"$f":"_xlfn.XLOOKUP(' Flight data base'!D174,'airport codes'!$D$3:$D$2103,'airport codes'!$C$3:$C$2103)","v":"Germany"},"CPT",{"$f":"_xlfn.XLOOKUP(' Flight data base'!F174,'airport codes'!$D$3:$D$2103,'airport codes'!$C$3:$C$2103)","v":"South Africa"},"20DEC20",2225,1035,"20DEC20",null,null,null,null,null,null,"X","PAXULD"]
[174,"Lufthansa","LH574","MUC",{"$f":"_xlfn.XLOOKUP(' Flight data base'!D175,'airport codes'!$D$3:$D$2103,'airport codes'!$C$3:$C$2103)","v":"Germany"},"CPT",{"$f":"_xlfn.XLOOKUP(' Flight data base'!F175,'airport codes'!$D$3:$D$2103,'airport codes'!$C$3:$C$2103)","v":"South Africa"},"29DEC20",2225,1035,"29DEC20",null,"X",null,null,null,null,null,"PAXULD"]
[175,"Lufthansa","LH574","MUC",{"$f":"_xlfn.XLOOKUP(' Flight data base'!D176,'airport codes'!$D$3:$D$2103,'airport codes'!$C$3:$C$2103)","v":"Germany"},"CPT",{"$f":"_xlfn.XLOOKUP(' Flight data base'!F176,'airport codes'!$D$3:$D$2103,'airport codes'!$C$3:$C$2103)","v":"South Africa"},"2021-01-03",2225,1040,"2021-01-05",null,"X",null,null,null,null,"X","PAXULD"]
[176,"Lufthansa","LH574","MUC",{"$f":"_xlfn.XLOOKUP(' Flight data base'!D177,'airport codes'!$D$3:$D$2103,'airport codes'!$C$3:$C$2103)","v":"Germany"},"CPT",{"$f":"_xlfn.XLOOKUP(' Flight data base'!F177,'airport codes'!$D$3:$D$2103,'airport codes'!$C$3:$C$2103)","v":"South Africa"},"2021-01-04",2225,1040,"2021-01-04","X",null,null,null,null,null,null,"PAXULD"]
[177,"Lufthansa","LH574","MUC",{"$f":"_xlfn.XLOOKUP(' Flight data base'!D178,'airport codes'!$D$3:$D$2103,'airport codes'!$C$3:$C$2103)","v":"Germany"},"CPT",{"$f":"_xlfn.XLOOKUP(' Flight data base'!F178,'airport codes'!$D$3:$D$2103,'airport codes'!$C$3:$C$2103)","v":"South Africa"},"2021-01-06",2225,1040,"2021-01-06",null,null,"X",null,null,null,null,"PAXULD"]
[178,"Lufthansa","LH574","MUC",{"$f":"_xlfn.XLOOKUP(' Flight data base'!D179,'airport codes'!$D$3:$D$2103,'airport codes'!$C$3:$C$2103)","v":"Germany"},"CPT",{"$f":"_xlfn.XLOOKUP(' Flight data base'!F179,'airport codes'!$D$3:$D$2103,'airport codes'!$C$3:$C$2103)","v":"South Africa"},"2021-01-07",2225,1040,"2021-01-12",null,"X",null,"X",null,null,"X","PAXULD"]
[179,"Lufthansa","LH574","MUC",{"$f":"_xlfn.XLOOKUP(' Flight data base'!D180,'airport codes'!$D$3:$D$2103,'airport codes'!$C$3:$C$2103)","v":"Germany"},"CPT",{"$f":"_xlfn.XLOOKUP(' Flight data base'!F180,'airport codes'!$D$3:$D$2103,'airport codes'!$C$3:$C$2103)","v":"South Africa"},"18DEC20",1800,610,"18DEC20",null,null,null,null,"X",null,null,"PAXULD"]
[180,"Lufthansa","LH576","FRA",{"$f":"_xlfn.XLOOKUP(' Flight data base'!D181,'airport codes'!$D$3:$D$2103,'airport codes'!$C$3:$C$2103)","v":"Germany"},"CPT",{"$f":"_xlfn.XLOOKUP(' Flight data base'!F181,'airport codes'!$D$3:$D$2103,'airport codes'!$C$3:$C$2103)","v":"South Africa"},"16DEC20",2210,1050,"2021-03-26","X",null,"X",null,"X",null,null,"PAXULD"]
[181,"Lufthansa","LH580","FRA",{"$f":"_xlfn.XLOOKUP(' Flight data base'!D182,'airport codes'!$D$3:$D$2103,'airport codes'!$C$3:$C$2103)","v":"Germany"},"CAI",{"$f":"_xlfn.XLOOKUP(' Flight data base'!F182,'airport codes'!$D$3:$D$2103,'airport codes'!$C$3:$C$2103)","v":"Egypt"},"25DEC20",1330,1840,"25DEC20",null,null,null,null,"X",null,null,"PAXULD"]
[182,"Lufthansa","LH580","FRA",{"$f":"_xlfn.XLOOKUP(' Flight data base'!D183,'airport codes'!$D$3:$D$2103,'airport codes'!$C$3:$C$2103)","v":"Germany"},"CAI",{"$f":"_xlfn.XLOOKUP(' Flight data base'!F183,'airport codes'!$D$3:$D$2103,'airport codes'!$C$3:$C$2103)","v":"Egypt"},"26DEC20",1330,1840,"30DEC20","X","X","X",null,null,"X","X","PAXULD"]
[183,"Lufthansa","LH580","FRA",{"$f":"_xlfn.XLOOKUP(' Flight data base'!D184,'airport codes'!$D$3:$D$2103,'airport codes'!$C$3:$C$2103)","v":"Germany"},"CAI",{"$f":"_xlfn.XLOOKUP(' Flight data base'!F184,'airport codes'!$D$3:$D$2103,'airport codes'!$C$3:$C$2103)","v":"Egypt"},"2021-01-03",1330,1840,"2021-01-03",null,null,null,null,null,null,"X","PAXULD"]
[184,"Lufthansa","LH580","FRA",{"$f":"_xlfn.XLOOKUP(' Flight data base'!D185,'airport codes'!$D$3:$D$2103,'airport codes'!$C$3:$C$2103)","v":"Germany"},"CAI",{"$f":"_xlfn.XLOOKUP(' Flight data base'!F185,'airport codes'!$D$3:$D$2103,'airport codes'!$C$3:$C$2103)","v":"Egypt"},"2021-01-01",1330,1840,"2021-01-01",null,null,null,null,"X",null,null,"PAXULD"]
[185,"Lufthansa","LH580","FRA",{"$f":"_xlfn.XLOOKUP(' Flight data base'!D186,'airport codes'!$D$3:$D$2103,'airport codes'!$C$3:$C$2103)","v":"Germany"},"CAI",{"$f":"_xlfn.XLOOKUP(' Flight data base'!F186,'airport codes'!$D$3:$D$2103,'airport codes'!$C$3:$C$2103)","v":"Egypt"},"2021-01-02",1330,1840,"2021-01-02",null,null,null,null,null,"X",null,"PAXULD"]
[186,"Lufthansa","LH580","FRA",{"$f":"_xlfn.XLOOKUP(' Flight data base'!D187,'airport codes'!$D$3:$D$2103,'airport codes'!$C$3:$C$2103)","v":"Germany"},"CAI",{"$f":"_xlfn.XLOOKUP(' Flight data base'!F187,'airport codes'!$D$3:$D$2103,'airport codes'!$C$3:$C$2103)","v":"Egypt"},"2021-01-04",1330,1840,"2021-01-04","X",null,null,null,null,null,null,"PAXULD"]
[187,"Lufthansa","LH580","FRA",{"$f":"_xlfn.XLOOKUP(' Flight data base'!D188,'airport codes'!$D$3:$D$2103,'airport codes'!$C$3:$C$2103)","v":"Germany"},"CAI",{"$f":"_xlfn.XLOOKUP(' Flight data base'!F188,'airport codes'!$D$3:$D$2103,'airport codes'!$C$3:$C$2103)","v":"Egypt"},"2021-01-05",1330,1840,"2021-01-06",null,"X","X",null,null,null,null,"PAXULD"]
[188,"Lufthansa","LH580","FRA",{"$f":"_xlfn.XLOOKUP(' Flight data base'!D189,'airport codes'!$D$3:$D$2103,'airport codes'!$C$3:$C$2103)","v":"Germany"},"CAI",{"$f":"_xlfn.XLOOKUP(' Flight data base'!F189,'airport codes'!$D$3:$D$2103,'airport codes'!$C$3:$C$2103)","v":"Egypt"},"2021-01-07",1330,1840,"2021-01-08",null,null,null,"X","X",null,null,"PAXULD"]
[189,"Lufthansa","LH580","FRA",{"$f":"_xlfn.XLOOKUP(' Flight data base'!D190,'airport codes'!$D$3:$D$2103,'airport codes'!$C$3:$C$2103)","v":"Germany"},"CAI",{"$f":"_xlfn.XLOOKUP(' Flight data base'!F190,'airport codes'!$D$3:$D$2103,'airport codes'!$C$3:$C$2103)","v":"Egypt"},"2021-01-09",1330,1840,"2021-01-09",null,null,null,null,null,"X",null,"PAXULD"]
[190,"Lufthansa","LH580","FRA",{"$f":"_xlfn.XLOOKUP(' Flight data base'!D191,'airport codes'!$D$3:$D$2103,'airport codes'!$C$3:$C$2103)","v":"Germany"},"CAI",{"$f":"_xlfn.XLOOKUP(' Flight data base'!F191,'airport codes'!$D$3:$D$2103,'airport codes'!$C$3:$C$2103)","v":"Egypt"},"2021-01-10",1330,1840,"2021-03-27","X","X","X","X","X","X","X","PAXULD"]
[191,"Lufthansa","LH580","FRA",{"$f":"_xlfn.XLOOKUP(' Flight data base'!D192,'airport codes'!$D$3:$D$2103,'airport codes'!$C$3:$C$2103)","v":"Germany"},"CAI",{"$f":"_xlfn.XLOOKUP(' Flight data base'!F192,'airport codes'!$D$3:$D$2103,'airport codes'!$C$3:$C$2103)","v":"Egypt"},"15DEC20",1330,1840,"15DEC20",null,"X",null,null,null,null,null,"PAXULD"]
[192,"Lufthansa","LH580","FRA",{"$f":"_xlfn.XLOOKUP(' Flight data base'!D193,'airport codes'!$D$3:$D$2103,'airport codes'!$C$3:$C$2103)","v":"Germany"},"CAI",{"$f":"_xlfn.XLOOKUP(' Flight data base'!F193,'airport codes'!$D$3:$D$2103,'airport codes'!$C$3:$C$2103)","v":"Egypt"},"16DEC20",1330,1840,"23DEC20","X","X","X","X","X","X","X","PAXULD"]
[193,"Lufthansa","LH590","FRA",{"$f":"_xlfn.XLOOKUP(' Flight data base'!D194,'airport codes'!$D$3:$D$2103,'airport codes'!$C$3:$C$2103)","v":"Germany"},"NBO",{"$f":"_xlfn.XLOOKUP(' Flight data base'!F194,'airport codes'!$D$3:$D$2103,'airport codes'!$C$3:$C$2103)","v":"Kenya"},"18DEC20",1115,2115,"18DEC20",null,null,null,null,"X",null,null,"PAXULD"]
[194,"Lufthansa","LH590","FRA",{"$f":"_xlfn.XLOOKUP(' Flight data base'!D195,'airport codes'!$D$3:$D$2103,'airport codes'!$C$3:$C$2103)","v":"Germany"},"NBO",{"$f":"_xlfn.XLOOKUP(' Flight data base'!F195,'airport codes'!$D$3:$D$2103,'airport codes'!$C$3:$C$2103)","v":"Kenya"},"20DEC20",1115,2115,"22DEC20",null,"X",null,null,null,null,"X","PAXULD"]
[195,"Lufthansa","LH590","FRA",{"$f":"_xlfn.XLOOKUP(' Flight data base'!D196,'airport codes'!$D$3:$D$2103,'airport codes'!$C$3:$C$2103)","v":"Germany"},"NBO",{"$f":"_xlfn.XLOOKUP(' Flight data base'!F196,'airport codes'!$D$3:$D$2103,'airport codes'!$C$3:$C$2103)","v":"Kenya"},"19DEC20",1115,2115,"19DEC20",null,null,null,null,null,"X",null,"PAXULD"]
[196,"Lufthansa","LH590","FRA",{"$f":"_xlfn.XLOOKUP(' Flight data base'!D197,'airport codes'!$D$3:$D$2103,'airport codes'!$C$3:$C$2103)","v":"Germany"},"NBO",{"$f":"_xlfn.XLOOKUP(' Flight data base'!F197,'airport codes'!$D$3:$D$2103,'airport codes'!$C$3:$C$2103)","v":"Kenya"},"26DEC20",1115,2115,"26DEC20",null,null,null,null,null,"X",null,"PAXULD"]
[197,"Lufthansa","LH590","FRA",{"$f":"_xlfn.XLOOKUP(' Flight data base'!D198,'airport codes'!$D$3:$D$2103,'airport codes'!$C$3:$C$2103)","v":"Germany"},"NBO",{"$f":"_xlfn.XLOOKUP(' Flight data base'!F198,'airport codes'!$D$3:$D$2103,'airport codes'!$C$3:$C$2103)","v":"Kenya"},"27DEC20",1115,2115,"29DEC20",null,"X",null,null,null,null,"X","PAXULD"]
[198,"Lufthansa","LH590","FRA",{"$f":"_xlfn.XLOOKUP(' Flight data base'!D199,'airport codes'!$D$3:$D$2103,'airport codes'!$C$3:$C$2103)","v":"Germany"},"NBO",{"$f":"_xlfn.XLOOKUP(' Flight data base'!F199,'airport codes'!$D$3:$D$2103,'airport codes'!$C$3:$C$2103)","v":"Kenya"},"2021-01-02",1115,2115,"2021-01-05",null,"X",null,null,null,"X","X","PAXULD"]
[199,"Lufthansa","LH590","FRA",{"$f":"_xlfn.XLOOKUP(' Flight data base'!D200,'airport codes'!$D$3:$D$2103,'airport codes'!$C$3:$C$2103)","v":"Germany"},"NBO",{"$f":"_xlfn.XLOOKUP(' Flight data base'!F200,'airport codes'!$D$3:$D$2103,'airport codes'!$C$3:$C$2103)","v":"Kenya"},"2021-01-07",1115,2115,"2021-01-07",null,null,null,"X",null,null,null,"PAXULD"]
[200,"Lufthansa","LH590","FRA",{"$f":"_xlfn.XLOOKUP(' Flight data base'!D201,'airport codes'!$D$3:$D$2103,'airport codes'!$C$3:$C$2103)","v":"Germany"},"NBO",{"$f":"_xlfn.XLOOKUP(' Flight data base'!F201,'airport codes'!$D$3:$D$2103,'airport codes'!$C$3:$C$2103)","v":"Kenya"},"2021-01-08",1115,2115,"2021-01-08",null,null,null,null,"X",null,null,"PAXULD"]
[201,"Lufthansa","LH590","FRA",{"$f":"_xlfn.XLOOKUP(' Flight data base'!D202,'airport codes'!$D$3:$D$2103,'airport codes'!$C$3:$C$2103)","v":"Germany"},"NBO",{"$f":"_xlfn.XLOOKUP(' Flight data base'!F202,'airport codes'!$D$3:$D$2103,'airport codes'!$C$3:$C$2103)","v":"Kenya"},"2021-01-09",1115,2115,"2021-01-09",null,null,null,null,null,"X",null,"PAXULD"]
[202,"Lufthansa","LH590","FRA",{"$f":"_xlfn.XLOOKUP(' Flight data base'!D203,'airport codes'!$D$3:$D$2103,'airport codes'!$C$3:$C$2103)","v":"Germany"},"NBO",{"$f":"_xlfn.XLOOKUP(' Flight data base'!F203,'airport codes'!$D$3:$D$2103,'airport codes'!$C$3:$C$2103)","v":"Kenya"},"2021-01-10",1115,2115,"2021-01-10",null,null,null,null,null,null,"X","PAXULD"]
[203,"Lufthansa","LH590","FRA",{"$f":"_xlfn.XLOOKUP(' Flight data base'!D204,'airport codes'!$D$3:$D$2103,'airport codes'!$C$3:$C$2103)","v":"Germany"},"NBO",{"$f":"_xlfn.XLOOKUP(' Flight data base'!F204,'airport codes'!$D$3:$D$2103,'airport codes'!$C$3:$C$2103)","v":"Kenya"},"2021-01-12",1115,2115,"28FEB21",null,"X",null,"X",null,"X","X","PAXULD"]
[204,"Lufthansa","LH590","FRA",{"$f":"_xlfn.XLOOKUP(' Flight data base'!D205,'airport codes'!$D$3:$D$2103,'airport codes'!$C$3:$C$2103)","v":"Germany"},"NBO",{"$f":"_xlfn.XLOOKUP(' Flight data base'!F205,'airport codes'!$D$3:$D$2103,'airport codes'!$C$3:$C$2103)","v":"Kenya"},"17DEC20",1115,2115,"17DEC20",null,null,null,"X",null,null,null,"PAXULD"]
[205,"Lufthansa","LH590","FRA",{"$f":"_xlfn.XLOOKUP(' Flight data base'!D206,'airport codes'!$D$3:$D$2103,'airport codes'!$C$3:$C$2103)","v":"Germany"},"NBO",{"$f":"_xlfn.XLOOKUP(' Flight data base'!F206,'airport codes'!$D$3:$D$2103,'airport codes'!$C$3:$C$2103)","v":"Kenya"},"15DEC20",1115,2115,"15DEC20",null,"X",null,null,null,null,null,"PAXULD"]
[206,"Lufthansa","LH594","FRA",{"$f":"_xlfn.XLOOKUP(' Flight data base'!D207,'airport codes'!$D$3:$D$2103,'airport codes'!$C$3:$C$2103)","v":"Germany"},"PHC",{"$f":"_xlfn.XLOOKUP(' Flight data base'!F207,'airport codes'!$D$3:$D$2103,'airport codes'!$C$3:$C$2103)","v":"Nigeria"},"22DEC20",1115,1930,"22DEC20",null,"X",null,null,null,null,null,"PAXULD"]
[207,"Lufthansa","LH594","FRA",{"$f":"_xlfn.XLOOKUP(' Flight data base'!D208,'airport codes'!$D$3:$D$2103,'airport codes'!$C$3:$C$2103)","v":"Germany"},"ABV",{"$f":"_xlfn.XLOOKUP(' Flight data base'!F208,'airport codes'!$D$3:$D$2103,'airport codes'!$C$3:$C$2103)","v":"Nigeria"},"22DEC20",1115,1725,"22DEC20",null,"X",null,null,null,null,null,"PAXULD"]
[208,"Lufthansa","LH594","FRA",{"$f":"_xlfn.XLOOKUP(' Flight data base'!D209,'airport codes'!$D$3:$D$2103,'airport codes'!$C$3:$C$2103)","v":"Germany"},"PHC",{"$f":"_xlfn.XLOOKUP(' Flight data base'!F209,'airport codes'!$D$3:$D$2103,'airport codes'!$C$3:$C$2103)","v":"Nigeria"},"26DEC20",1115,1930,"26DEC20",null,null,null,null,null,"X",null,"PAXULD"]
[209,"Lufthansa","LH594","FRA",{"$f":"_xlfn.XLOOKUP(' Flight data base'!D210,'airport codes'!$D$3:$D$2103,'airport codes'!$C$3:$C$2103)","v":"Germany"},"ABV",{"$f":"_xlfn.XLOOKUP(' Flight data base'!F210,'airport codes'!$D$3:$D$2103,'airport codes'!$C$3:$C$2103)","v":"Nigeria"},"26DEC20",1115,1725,"26DEC20",null,null,null,null,null,"X",null,"PAXULD"]
[210,"Lufthansa","LH594","FRA",{"$f":"_xlfn.XLOOKUP(' Flight data base'!D211,'airport codes'!$D$3:$D$2103,'airport codes'!$C$3:$C$2103)","v":"Germany"},"PHC",{"$f":"_xlfn.XLOOKUP(' Flight data base'!F211,'airport codes'!$D$3:$D$2103,'airport codes'!$C$3:$C$2103)","v":"Nigeria"},"27DEC20",1115,1930,"29DEC20",null,"X",null,null,null,null,"X","PAXULD"]
[211,"Lufthansa","LH594","FRA",{"$f":"_xlfn.XLOOKUP(' Flight data base'!D212,'airport codes'!$D$3:$D$2103,'airport codes'!$C$3:$C$2103)","v":"Germany"},"ABV",{"$f":"_xlfn.XLOOKUP(' Flight data base'!F212,'airport codes'!$D$3:$D$2103,'airport codes'!$C$3:$C$2103)","v":"Nigeria"},"27DEC20",1115,1725,"29DEC20",null,"X",null,null,null,null,"X","PAXULD"]
[212,"Lufthansa","LH594","FRA",{"$f":"_xlfn.XLOOKUP(' Flight data base'!D213,'airport codes'!$D$3:$D$2103,'airport codes'!$C$3:$C$2103)","v":"Germany"},"PHC",{"$f":"_xlfn.XLOOKUP(' Flight data base'!F213,'airport codes'!$D$3:$D$2103,'airport codes'!$C$3:$C$2103)","v":"Nigeria"},"2021-01-02",1115,1930,"2021-01-02",null,null,null,null,null,"X",null,"PAXULD"]
[213,"Lufthansa","LH594","FRA",{"$f":"_xlfn.XLOOKUP(' Flight data base'!D214,'airport codes'!$D$3:$D$2103,'airport codes'!$C$3:$C$2103)","v":"Germany"},"ABV",{"$f":"_xlfn.XLOOKUP(' Flight data base'!F214,'airport codes'!$D$3:$D$2103,'airport codes'!$C$3:$C$2103)","v":"Nigeria"},"2021-01-02",1115,1725,"2021-01-02",null,null,null,null,null,"X",null,"PAXULD"]
[214,"Lufthansa","LH594","FRA",{"$f":"_xlfn.XLOOKUP(' Flight data base'!D215,'airport codes'!$D$3:$D$2103,'airport codes'!$C$3:$C$2103)","v":"Germany"},"PHC",{"$f":"_xlfn.XLOOKUP(' Flight data base'!F215,'airport codes'!$D$3:$D$2103,'airport codes'!$C$3:$C$2103)","v":"Nigeria"},"2021-01-03",1115,1930,"2021-01-03",null,null,null,null,null,null,"X","PAXULD"]
[215,"Lufthansa","LH594","FRA",{"$f":"_xlfn.XLOOKUP(' Flight data base'!D216,'airport codes'!$D$3:$D$2103,'airport codes'!$C$3:$C$2103)","v":"Germany"},"ABV",{"$f":"_xlfn.XLOOKUP(' Flight data base'!F216,'airport codes'!$D$3:$D$2103,'airport codes'!$C$3:$C$2103)","v":"Nigeria"},"2021-01-03",1115,1725,"2021-01-03",null,null,null,null,null,null,"X","PAXULD"]
[216,"Lufthansa","LH594","FRA",{"$f":"_xlfn.XLOOKUP(' Flight data base'!D217,'airport codes'!$D$3:$D$2103,'airport codes'!$C$3:$C$2103)","v":"Germany"},"PHC",{"$f":"_xlfn.XLOOKUP(' Flight data base'!F217,'airport codes'!$D$3:$D$2103,'airport codes'!$C$3:$C$2103)","v":"Nigeria"},"2021-01-05",1115,1930,"2021-01-05",null,"X",null,null,null,null,null,"PAXULD"]
[217,"Lufthansa","LH594","FRA",{"$f":"_xlfn.XLOOKUP(' Flight data base'!D218,'airport codes'!$D$3:$D$2103,'airport codes'!$C$3:$C$2103)","v":"Germany"},"ABV",{"$f":"_xlfn.XLOOKUP(' Flight data base'!F218,'airport codes'!$D$3:$D$2103,'airport codes'!$C$3:$C$2103)","v":"Nigeria"},"2021-01-05",1115,1725,"2021-01-05",null,"X",null,null,null,null,null,"PAXULD"]
[218,"Lufthansa","LH594","FRA",{"$f":"_xlfn.XLOOKUP(' Flight data base'!D219,'airport codes'!$D$3:$D$2103,'airport codes'!$C$3:$C$2103)","v":"Germany"},"PHC",{"$f":"_xlfn.XLOOKUP(' Flight data base'!F219,'airport codes'!$D$3:$D$2103,'airport codes'!$C$3:$C$2103)","v":"Nigeria"},"2021-01-07",1115,1930,"25FEB21",null,null,null,"X",null,null,null,"PAXULD"]
[219,"Lufthansa","LH594","FRA",{"$f":"_xlfn.XLOOKUP(' Flight data base'!D220,'airport codes'!$D$3:$D$2103,'airport codes'!$C$3:$C$2103)","v":"Germany"},"ABV",{"$f":"_xlfn.XLOOKUP(' Flight data base'!F220,'airport codes'!$D$3:$D$2103,'airport codes'!$C$3:$C$2103)","v":"Nigeria"},"2021-01-07",1115,1725,"25FEB21",null,null,null,"X",null,null,null,"PAXULD"]
[220,"Lufthansa","LH594","FRA",{"$f":"_xlfn.XLOOKUP(' Flight data base'!D221,'airport codes'!$D$3:$D$2103,'airport codes'!$C$3:$C$2103)","v":"Germany"},"PHC",{"$f":"_xlfn.XLOOKUP(' Flight data base'!F221,'airport codes'!$D$3:$D$2103,'airport codes'!$C$3:$C$2103)","v":"Nigeria"},"2021-01-09",1115,1930,"2021-01-09",null,null,null,null,null,"X",null,"PAXULD"]
[221,"Lufthansa","LH594","FRA",{"$f":"_xlfn.XLOOKUP(' Flight data base'!D222,'airport codes'!$D$3:$D$2103,'airport codes'!$C$3:$C$2103)","v":"Germany"},"ABV",{"$f":"_xlfn.XLOOKUP(' Flight data base'!F222,'airport codes'!$D$3:$D$2103,'airport codes'!$C$3:$C$2103)","v":"Nigeria"},"2021-01-09",1115,1725,"2021-01-09",null,null,null,null,null,"X",null,"PAXULD"]
[222,"Lufthansa","LH594","FRA",{"$f":"_xlfn.XLOOKUP(' Flight data base'!D223,'airport codes'!$D$3:$D$2103,'airport codes'!$C$3:$C$2103)","v":"Germany"},"PHC",{"$f":"_xlfn.XLOOKUP(' Flight data base'!F223,'airport codes'!$D$3:$D$2103,'airport codes'!$C$3:$C$2103)","v":"Nigeria"},"2021-01-10",1115,1930,"2021-01-10",null,null,null,null,null,null,"X","PAXULD"]
[223,"Lufthansa","LH594","FRA",{"$f":"_xlfn.XLOOKUP(' Flight data base'!D224,'airport codes'!$D$3:$D$2103,'airport codes'!$C$3:$C$2103)","v":"Germany"},"ABV",{"$f":"_xlfn.XLOOKUP(' Flight data base'!F224,'airport codes'!$D$3:$D$2103,'airport codes'!$C$3:$C$2103)","v":"Nigeria"},"2021-01-10",1115,1725,"2021-01-10",null,null,null,null,null,null,"X","PAXULD"]
[224,"Lufthansa","LH594","FRA",{"$f":"_xlfn.XLOOKUP(' Flight data base'!D225,'airport codes'!$D$3:$D$2103,'airport codes'!$C$3:$C$2103)","v":"Germany"},"ABV",{"$f":"_xlfn.XLOOKUP(' Flight data base'!F225,'airport codes'!$D$3:$D$2103,'airport codes'!$C$3:$C$2103)","v":"Nigeria"},"15DEC20",1115,1725,"15DEC20",null,"X",null,null,null,null,null,"PAXULD"]
[225,"Lufthansa","LH594","FRA",{"$f":"_xlfn.XLOOKUP(' Flight data base'!D226,'airport codes'!$D$3:$D$2103,'airport codes'!$C$3:$C$2103)","v":"Germany"},"ABV",{"$f":"_xlfn.XLOOKUP(' Flight data base'!F226,'airport codes'!$D$3:$D$2103,'airport codes'!$C$3:$C$2103)","v":"Nigeria"},"17DEC20",1115,1725,"17DEC20",null,null,null,"X",null,null,null,"PAXULD"]
[226,"Lufthansa","LH594","FRA",{"$f":"_xlfn.XLOOKUP(' Flight data base'!D227,'airport codes'!$D$3:$D$2103,'airport codes'!$C$3:$C$2103)","v":"Germany"},"ABV",{"$f":"_xlfn.XLOOKUP(' Flight data base'!F227,'airport codes'!$D$3:$D$2103,'airport codes'!$C$3:$C$2103)","v":"Nigeria"},"19DEC20",1115,1725,"19DEC20",null,null,null,null,null,"X",null,"PAXULD"]
[227,"Lufthansa","LH594","FRA",{"$f":"_xlfn.XLOOKUP(' Flight data base'!D228,'airport codes'!$D$3:$D$2103,'airport codes'!$C$3:$C$2103)","v":"Germany"},"ABV",{"$f":"_xlfn.XLOOKUP(' Flight data base'!F228,'airport codes'!$D$3:$D$2103,'airport codes'!$C$3:$C$2103)","v":"Nigeria"},"20DEC20",1115,1725,"20DEC20",null,null,null,null,null,null,"X","PAXULD"]
[228,"Lufthansa","LH594","FRA",{"$f":"_xlfn.XLOOKUP(' Flight data base'!D229,'airport codes'!$D$3:$D$2103,'airport codes'!$C$3:$C$2103)","v":"Germany"},"PHC",{"$f":"_xlfn.XLOOKUP(' Flight data base'!F229,'airport codes'!$D$3:$D$2103,'airport codes'!$C$3:$C$2103)","v":"Nigeria"},"2021-01-12",1115,1930,"2021-01-12",null,"X",null,null,null,null,null,"PAXULD"]
[229,"Lufthansa","LH594","FRA",{"$f":"_xlfn.XLOOKUP(' Flight data base'!D230,'airport codes'!$D$3:$D$2103,'airport codes'!$C$3:$C$2103)","v":"Germany"},"ABV",{"$f":"_xlfn.XLOOKUP(' Flight data base'!F230,'airport codes'!$D$3:$D$2103,'airport codes'!$C$3:$C$2103)","v":"Nigeria"},"2021-01-12",1115,1725,"2021-01-12",null,"X",null,null,null,null,null,"PAXULD"]
[230,"Lufthansa","LH8254","FRA",{"$f":"_xlfn.XLOOKUP(' Flight data base'!D231,'airport codes'!$D$3:$D$2103,'airport codes'!$C$3:$C$2103)","v":"Germany"},"DSS",{"$f":"_xlfn.XLOOKUP(' Flight data base'!F231,'airport codes'!$D$3:$D$2103,'airport codes'!$C$3:$C$2103)","v":"Senegal"},"18DEC20",1840,2345,"28DEC20","X",null,null,null,"X",null,null,"Freighter"]
[231,"Lufthansa","LH8264","FRA",{"$f":"_xlfn.XLOOKUP(' Flight data base'!D232,'airport codes'!$D$3:$D$2103,'airport codes'!$C$3:$C$2103)","v":"Germany"},"DSS",{"$f":"_xlfn.XLOOKUP(' Flight data base'!F232,'airport codes'!$D$3:$D$2103,'airport codes'!$C$3:$C$2103)","v":"Senegal"},"20DEC20",1455,2000,"20DEC20",null,null,null,null,null,null,"X","Freighter"]
[232,"Lufthansa","LH8264","FRA",{"$f":"_xlfn.XLOOKUP(' Flight data base'!D233,'airport codes'!$D$3:$D$2103,'airport codes'!$C$3:$C$2103)","v":"Germany"},"DSS",{"$f":"_xlfn.XLOOKUP(' Flight data base'!F233,'airport codes'!$D$3:$D$2103,'airport codes'!$C$3:$C$2103)","v":"Senegal"},"23DEC20",2100,205,"23DEC20",null,null,"X",null,null,null,null,"Freighter"]
[233,"Lufthansa","LH8264","FRA",{"$f":"_xlfn.XLOOKUP(' Flight data base'!D234,'airport codes'!$D$3:$D$2103,'airport codes'!$C$3:$C$2103)","v":"Germany"},"DSS",{"$f":"_xlfn.XLOOKUP(' Flight data base'!F234,'airport codes'!$D$3:$D$2103,'airport codes'!$C$3:$C$2103)","v":"Senegal"},"27DEC20",1455,2000,"27DEC20",null,null,null,null,null,null,"X","Freighter"]
[234,"Lufthansa","LH8264","FRA",{"$f":"_xlfn.XLOOKUP(' Flight data base'!D235,'airport codes'!$D$3:$D$2103,'airport codes'!$C$3:$C$2103)","v":"Germany"},"DSS",{"$f":"_xlfn.XLOOKUP(' Flight data base'!F235,'airport codes'!$D$3:$D$2103,'airport codes'!$C$3:$C$2103)","v":"Senegal"},"30DEC20",2100,205,"30DEC20",null,null,"X",null,null,null,null,"Freighter"]
[235,"Lufthansa","LH8264","FRA",{"$f":"_xlfn.XLOOKUP(' Flight data base'!D236,'airport codes'!$D$3:$D$2103,'airport codes'!$C$3:$C$2103)","v":"Germany"},"DSS",{"$f":"_xlfn.XLOOKUP(' Flight data base'!F236,'airport codes'!$D$3:$D$2103,'airport codes'!$C$3:$C$2103)","v":"Senegal"},"16DEC20",2100,205,"16DEC20",null,null,"X",null,null,null,null,"Freighter"]
[236,"Lufthansa","LH8266","FRA",{"$f":"_xlfn.XLOOKUP(' Flight data base'!D237,'airport codes'!$D$3:$D$2103,'airport codes'!$C$3:$C$2103)","v":"Germany"},"DSS",{"$f":"_xlfn.XLOOKUP(' Flight data base'!F237,'airport codes'!$D$3:$D$2103,'airport codes'!$C$3:$C$2103)","v":"Senegal"},"22DEC20",1505,2010,"29DEC20",null,"X",null,null,null,null,null,"Freighter"]
[237,"Lufthansa","LH8266","FRA",{"$f":"_xlfn.XLOOKUP(' Flight data base'!D238,'airport codes'!$D$3:$D$2103,'airport codes'!$C$3:$C$2103)","v":"Germany"},"DSS",{"$f":"_xlfn.XLOOKUP(' Flight data base'!F238,'airport codes'!$D$3:$D$2103,'airport codes'!$C$3:$C$2103)","v":"Senegal"},"15DEC20",1505,2010,"15DEC20",null,"X",null,null,null,null,null,"Freighter"]
[238,"Lufthansa","LH8290","FRA",{"$f":"_xlfn.XLOOKUP(' Flight data base'!D239,'airport codes'!$D$3:$D$2103,'airport codes'!$C$3:$C$2103)","v":"Germany"},"CAI",{"$f":"_xlfn.XLOOKUP(' Flight data base'!F239,'airport codes'!$D$3:$D$2103,'airport codes'!$C$3:$C$2103)","v":"Egypt"},"20DEC20",1725,155,"20DEC20",null,null,null,null,null,null,"X","Freighter"]
[239,"Lufthansa","LH8290","FRA",{"$f":"_xlfn.XLOOKUP(' Flight data base'!D240,'airport codes'!$D$3:$D$2103,'airport codes'!$C$3:$C$2103)","v":"Germany"},"CAI",{"$f":"_xlfn.XLOOKUP(' Flight data base'!F240,'airport codes'!$D$3:$D$2103,'airport codes'!$C$3:$C$2103)","v":"Egypt"},"22DEC20",950,1435,"22DEC20",null,"X",null,null,null,null,null,"Freighter"]
[240,"Lufthansa","LH8290","FRA",{"$f":"_xlfn.XLOOKUP(' Flight data base'!D241,'airport codes'!$D$3:$D$2103,'airport codes'!$C$3:$C$2103)","v":"Germany"},"CAI",{"$f":"_xlfn.XLOOKUP(' Flight data base'!F241,'airport codes'!$D$3:$D$2103,'airport codes'!$C$3:$C$2103)","v":"Egypt"},"27DEC20",1725,155,"27DEC20",null,null,null,null,null,null,"X","Freighter"]
[241,"Lufthansa","LH8290","FRA",{"$f":"_xlfn.XLOOKUP(' Flight data base'!D242,'airport codes'!$D$3:$D$2103,'airport codes'!$C$3:$C$2103)","v":"Germany"},"CAI",{"$f":"_xlfn.XLOOKUP(' Flight data base'!F242,'airport codes'!$D$3:$D$2103,'airport codes'!$C$3:$C$2103)","v":"Egypt"},"29DEC20",1725,155,"29DEC20",null,"X",null,null,null,null,null,"Freighter"]
[242,"Lufthansa","LH8290","FRA",{"$f":"_xlfn.XLOOKUP(' Flight data base'!D243,'airport codes'!$D$3:$D$2103,'airport codes'!$C$3:$C$2103)","v":"Germany"},"CAI",{"$f":"_xlfn.XLOOKUP(' Flight data base'!F243,'airport codes'!$D$3:$D$2103,'airport codes'!$C$3:$C$2103)","v":"Egypt"},"2021-01-02",1725,155,"2021-03-20",null,null,null,null,null,"X",null,"Freighter"]
[243,"Lufthansa","LH8290","FRA",{"$f":"_xlfn.XLOOKUP(' Flight data base'!D244,'airport codes'!$D$3:$D$2103,'airport codes'!$C$3:$C$2103)","v":"Germany"},"CAI",{"$f":"_xlfn.XLOOKUP(' Flight data base'!F244,'airport codes'!$D$3:$D$2103,'airport codes'!$C$3:$C$2103)","v":"Egypt"},"2021-01-03",1725,155,"2021-03-24",null,"X","X",null,null,null,"X","Freighter"]
[244,"Lufthansa","LH8290","FRA",{"$f":"_xlfn.XLOOKUP(' Flight data base'!D245,'airport codes'!$D$3:$D$2103,'airport codes'!$C$3:$C$2103)","v":"Germany"},"CAI",{"$f":"_xlfn.XLOOKUP(' Flight data base'!F245,'airport codes'!$D$3:$D$2103,'airport codes'!$C$3:$C$2103)","v":"Egypt"},"15DEC20",1725,155,"15DEC20",null,"X",null,null,null,null,null,"Freighter"]
[245,"Lufthansa","LH8290","FRA",{"$f":"_xlfn.XLOOKUP(' Flight data base'!D246,'airport codes'!$D$3:$D$2103,'airport codes'!$C$3:$C$2103)","v":"Germany"},"CAI",{"$f":"_xlfn.XLOOKUP(' Flight data base'!F246,'airport codes'!$D$3:$D$2103,'airport codes'!$C$3:$C$2103)","v":"Egypt"},"16DEC20",1725,155,"16DEC20",null,null,"X",null,null,null,null,"Freighter"]
[246,"Lufthansa","LH8292","FRA",{"$f":"_xlfn.XLOOKUP(' Flight data base'!D247,'airport codes'!$D$3:$D$2103,'airport codes'!$C$3:$C$2103)","v":"Germany"},"CAI",{"$f":"_xlfn.XLOOKUP(' Flight data base'!F247,'airport codes'!$D$3:$D$2103,'airport codes'!$C$3:$C$2103)","v":"Egypt"},"23DEC20",730,1215,"23DEC20",null,null,"X",null,null,null,null,"Freighter"]
[247,"Lufthansa","LH8294","FRA",{"$f":"_xlfn.XLOOKUP(' Flight data base'!D248,'airport codes'!$D$3:$D$2103,'airport codes'!$C$3:$C$2103)","v":"Germany"},"CAI",{"$f":"_xlfn.XLOOKUP(' Flight data base'!F248,'airport codes'!$D$3:$D$2103,'airport codes'!$C$3:$C$2103)","v":"Egypt"},"25DEC20",730,1215,"25DEC20",null,null,null,null,"X",null,null,"Freighter"]
[248,"Lufthansa","LH8294","FRA",{"$f":"_xlfn.XLOOKUP(' Flight data base'!D249,'airport codes'!$D$3:$D$2103,'airport codes'!$C$3:$C$2103)","v":"Germany"},"CAI",{"$f":"_xlfn.XLOOKUP(' Flight data base'!F249,'airport codes'!$D$3:$D$2103,'airport codes'!$C$3:$C$2103)","v":"Egypt"},"29DEC20",730,1215,"29DEC20",null,"X",null,null,null,null,null,"Freighter"]
[249,"Lufthansa","LH8294","FRA",{"$f":"_xlfn.XLOOKUP(' Flight data base'!D250,'airport codes'!$D$3:$D$2103,'airport codes'!$C$3:$C$2103)","v":"Germany"},"CAI",{"$f":"_xlfn.XLOOKUP(' Flight data base'!F250,'airport codes'!$D$3:$D$2103,'airport codes'!$C$3:$C$2103)","v":"Egypt"},"2021-01-01",730,1215,"2021-01-01",null,null,null,null,"X",null,null,"Freighter"]
[250,"Lufthansa","LH8294","FRA",{"$f":"_xlfn.XLOOKUP(' Flight data base'!D251,'airport codes'!$D$3:$D$2103,'airport codes'!$C$3:$C$2103)","v":"Germany"},"CAI",{"$f":"_xlfn.XLOOKUP(' Flight data base'!F251,'airport codes'!$D$3:$D$2103,'airport codes'!$C$3:$C$2103)","v":"Egypt"},"2021-01-05",730,1215,"2021-01-26",null,"X",null,null,null,null,null,"Freighter"]
[251,"Lufthansa","LH8294","FRA",{"$f":"_xlfn.XLOOKUP(' Flight data base'!D252,'airport codes'!$D$3:$D$2103,'airport codes'!$C$3:$C$2103)","v":"Germany"},"CAI",{"$f":"_xlfn.XLOOKUP(' Flight data base'!F252,'airport codes'!$D$3:$D$2103,'airport codes'!$C$3:$C$2103)","v":"Egypt"},"17DEC20",730,1215,"17DEC20",null,null,null,"X",null,null,null,"Freighter"]
[252,"Lufthansa","LH8294","FRA",{"$f":"_xlfn.XLOOKUP(' Flight data base'!D253,'airport codes'!$D$3:$D$2103,'airport codes'!$C$3:$C$2103)","v":"Germany"},"CAI",{"$f":"_xlfn.XLOOKUP(' Flight data base'!F253,'airport codes'!$D$3:$D$2103,'airport codes'!$C$3:$C$2103)","v":"Egypt"},"20DEC20",730,1215,"22DEC20",null,"X",null,null,null,null,"X","Freighter"]
[253,"Eurowings","EW1278","FRA",{"$f":"_xlfn.XLOOKUP(' Flight data base'!D254,'airport codes'!$D$3:$D$2103,'airport codes'!$C$3:$C$2103)","v":"Germany"},"WDH",{"$f":"_xlfn.XLOOKUP(' Flight data base'!F254,'airport codes'!$D$3:$D$2103,'airport codes'!$C$3:$C$2103)","v":"Namibia"},"2020-11-10",2040,800,"2021-03-27",null,"X",null,"X",null,"X",null,"PAXULD"]
[254,"Eurowings","EW1278","FRA",{"$f":"_xlfn.XLOOKUP(' Flight data base'!D255,'airport codes'!$D$3:$D$2103,'airport codes'!$C$3:$C$2103)","v":"Germany"},"WDH",{"$f":"_xlfn.XLOOKUP(' Flight data base'!F255,'airport codes'!$D$3:$D$2103,'airport codes'!$C$3:$C$2103)","v":"Namibia"},"2021-01-10",2040,800,"2021-01-10",null,null,null,null,null,null,"X","PAXULD"]
[255,"Austrian Airlines","OS031","VIE",{"$f":"_xlfn.XLOOKUP(' Flight data base'!D256,'airport codes'!$D$3:$D$2103,'airport codes'!$C$3:$C$2103)","v":"Austria"},"CPT",{"$f":"_xlfn.XLOOKUP(' Flight data base'!F256,'airport codes'!$D$3:$D$2103,'airport codes'!$C$3:$C$2103)","v":"South Africa"},"25DEC20",2325,1220,"2021-01-01",null,null,null,null,"X",null,null,"PAXULD"]
[256,"Austrian Airlines","OS031","VIE",{"$f":"_xlfn.XLOOKUP(' Flight data base'!D257,'airport codes'!$D$3:$D$2103,'airport codes'!$C$3:$C$2103)","v":"Austria"},"CPT",{"$f":"_xlfn.XLOOKUP(' Flight data base'!F257,'airport codes'!$D$3:$D$2103,'airport codes'!$C$3:$C$2103)","v":"South Africa"},"18DEC20",2325,1220,"18DEC20",null,null,null,null,"X",null,null,"PAXULD"]
[257,"Austrian Airlines","OS031","VIE",{"$f":"_xlfn.XLOOKUP(' Flight data base'!D258,'airport codes'!$D$3:$D$2103,'airport codes'!$C$3:$C$2103)","v":"Austria"},"CPT",{"$f":"_xlfn.XLOOKUP(' Flight data base'!F258,'airport codes'!$D$3:$D$2103,'airport codes'!$C$3:$C$2103)","v":"South Africa"},"21DEC20",1725,620,"21DEC20","X",null,null,null,null,null,null,"PAXULD"]
[258,"Austrian Airlines","OS031","VIE",{"$f":"_xlfn.XLOOKUP(' Flight data base'!D259,'airport codes'!$D$3:$D$2103,'airport codes'!$C$3:$C$2103)","v":"Austria"},"CPT",{"$f":"_xlfn.XLOOKUP(' Flight data base'!F259,'airport codes'!$D$3:$D$2103,'airport codes'!$C$3:$C$2103)","v":"South Africa"},"28DEC20",1725,620,"2021-01-04","X",null,null,null,null,null,null,"PAXULD"]
[259,"Austrian Airlines","OS031","VIE",{"$f":"_xlfn.XLOOKUP(' Flight data base'!D260,'airport codes'!$D$3:$D$2103,'airport codes'!$C$3:$C$2103)","v":"Austria"},"CPT",{"$f":"_xlfn.XLOOKUP(' Flight data base'!F260,'airport codes'!$D$3:$D$2103,'airport codes'!$C$3:$C$2103)","v":"South Africa"},"2021-01-08",1725,620,"26FEB21","X",null,null,null,"X",null,null,"PAXULD"]
[260,"Austrian Airlines","OS1063","VIE",{"$f":"_xlfn.XLOOKUP(' Flight data base'!D261,'airport codes'!$D$3:$D$2103,'airport codes'!$C$3:$C$2103)","v":"Austria"},"CAI",{"$f":"_xlfn.XLOOKUP(' Flight data base'!F261,'airport codes'!$D$3:$D$2103,'airport codes'!$C$3:$C$2103)","v":"Egypt"},"19DEC20",1345,1810,"19DEC20",null,null,null,null,null,"X",null,"PAXULD"]
[261,"Austrian Airlines","OS1063","VIE",{"$f":"_xlfn.XLOOKUP(' Flight data base'!D262,'airport codes'!$D$3:$D$2103,'airport codes'!$C$3:$C$2103)","v":"Austria"},"CAI",{"$f":"_xlfn.XLOOKUP(' Flight data base'!F262,'airport codes'!$D$3:$D$2103,'airport codes'!$C$3:$C$2103)","v":"Egypt"},"20DEC20",2240,305,"20DEC20",null,null,null,null,null,null,"X","PAXULD"]
[262,"Austrian Airlines","OS1063","VIE",{"$f":"_xlfn.XLOOKUP(' Flight data base'!D263,'airport codes'!$D$3:$D$2103,'airport codes'!$C$3:$C$2103)","v":"Austria"},"CAI",{"$f":"_xlfn.XLOOKUP(' Flight data base'!F263,'airport codes'!$D$3:$D$2103,'airport codes'!$C$3:$C$2103)","v":"Egypt"},"2021-01-02",1345,1810,"2021-01-09",null,null,null,null,null,"X",null,"PAXULD"]
[263,"Austrian Airlines","OS1063","VIE",{"$f":"_xlfn.XLOOKUP(' Flight data base'!D264,'airport codes'!$D$3:$D$2103,'airport codes'!$C$3:$C$2103)","v":"Austria"},"CAI",{"$f":"_xlfn.XLOOKUP(' Flight data base'!F264,'airport codes'!$D$3:$D$2103,'airport codes'!$C$3:$C$2103)","v":"Egypt"},"2021-01-03",2240,305,"2021-01-10",null,null,null,null,null,null,"X","PAXULD"]
[264,"Austrian Airlines","OS863","VIE",{"$f":"_xlfn.XLOOKUP(' Flight data base'!D265,'airport codes'!$D$3:$D$2103,'airport codes'!$C$3:$C$2103)","v":"Austria"},"CAI",{"$f":"_xlfn.XLOOKUP(' Flight data base'!F265,'airport codes'!$D$3:$D$2103,'airport codes'!$C$3:$C$2103)","v":"Egypt"},"18DEC20",2240,305,"18DEC20",null,null,null,null,"X",null,null,"PAXULD"]
[265,"Austrian Airlines","OS863","VIE",{"$f":"_xlfn.XLOOKUP(' Flight data base'!D266,'airport codes'!$D$3:$D$2103,'airport codes'!$C$3:$C$2103)","v":"Austria"},"CAI",{"$f":"_xlfn.XLOOKUP(' Flight data base'!F266,'airport codes'!$D$3:$D$2103,'airport codes'!$C$3:$C$2103)","v":"Egypt"},"25DEC20",2240,305,"25DEC20",null,null,null,null,"X",null,null,"PAXULD"]
[266,"Austrian Airlines","OS863","VIE",{"$f":"_xlfn.XLOOKUP(' Flight data base'!D267,'airport codes'!$D$3:$D$2103,'airport codes'!$C$3:$C$2103)","v":"Austria"},"CAI",{"$f":"_xlfn.XLOOKUP(' Flight data base'!F267,'airport codes'!$D$3:$D$2103,'airport codes'!$C$3:$C$2103)","v":"Egypt"},"30DEC20",1345,1810,"30DEC20",null,null,"X",null,null,null,null,"PAXULD"]
[267,"Austrian Airlines","OS863","VIE",{"$f":"_xlfn.XLOOKUP(' Flight data base'!D268,'airport codes'!$D$3:$D$2103,'airport codes'!$C$3:$C$2103)","v":"Austria"},"CAI",{"$f":"_xlfn.XLOOKUP(' Flight data base'!F268,'airport codes'!$D$3:$D$2103,'airport codes'!$C$3:$C$2103)","v":"Egypt"},"2021-01-01",2240,305,"2021-01-01",null,null,null,null,"X",null,null,"PAXULD"]
[268,"Austrian Airlines","OS863","VIE",{"$f":"_xlfn.XLOOKUP(' Flight data base'!D269,'airport codes'!$D$3:$D$2103,'airport codes'!$C$3:$C$2103)","v":"Austria"},"CAI",{"$f":"_xlfn.XLOOKUP(' Flight data base'!F269,'airport codes'!$D$3:$D$2103,'airport codes'!$C$3:$C$2103)","v":"Egypt"},"16DEC20",1345,1810,"16DEC20",null,null,"X",null,null,null,null,"PAXULD"]
[269,"Austrian Airlines","OS863","VIE",{"$f":"_xlfn.XLOOKUP(' Flight data base'!D270,'airport codes'!$D$3:$D$2103,'airport codes'!$C$3:$C$2103)","v":"Austria"},"CAI",{"$f":"_xlfn.XLOOKUP(' Flight data base'!F270,'airport codes'!$D$3:$D$2103,'airport codes'!$C$3:$C$2103)","v":"Egypt"},"2021-01-04",1345,1810,"2021-01-04","X",null,null,null,null,null,null,"PAXULD"]
[270,"Austrian Airlines","OS863","VIE",{"$f":"_xlfn.XLOOKUP(' Flight data base'!D271,'airport codes'!$D$3:$D$2103,'airport codes'!$C$3:$C$2103)","v":"Austria"},"CAI",{"$f":"_xlfn.XLOOKUP(' Flight data base'!F271,'airport codes'!$D$3:$D$2103,'airport codes'!$C$3:$C$2103)","v":"Egypt"},"2021-01-06",1345,1810,"2021-01-06",null,null,"X",null,null,null,null,"PAXULD"]
[271,"Austrian Airlines","OS863","VIE",{"$f":"_xlfn.XLOOKUP(' Flight data base'!D272,'airport codes'!$D$3:$D$2103,'airport codes'!$C$3:$C$2103)","v":"Austria"},"CAI",{"$f":"_xlfn.XLOOKUP(' Flight data base'!F272,'airport codes'!$D$3:$D$2103,'airport codes'!$C$3:$C$2103)","v":"Egypt"},"2021-01-08",2240,305,"2021-01-08",null,null,null,null,"X",null,null,"PAXULD"]
[272,"Austrian Airlines","OS863","VIE",{"$f":"_xlfn.XLOOKUP(' Flight data base'!D273,'airport codes'!$D$3:$D$2103,'airport codes'!$C$3:$C$2103)","v":"Austria"},"CAI",{"$f":"_xlfn.XLOOKUP(' Flight data base'!F273,'airport codes'!$D$3:$D$2103,'airport codes'!$C$3:$C$2103)","v":"Egypt"},"28DEC20",1345,1810,"28DEC20","X",null,null,null,null,null,null,"PAXULD"]
[273,"Austrian Airlines","OS863","VIE",{"$f":"_xlfn.XLOOKUP(' Flight data base'!D274,'airport codes'!$D$3:$D$2103,'airport codes'!$C$3:$C$2103)","v":"Austria"},"CAI",{"$f":"_xlfn.XLOOKUP(' Flight data base'!F274,'airport codes'!$D$3:$D$2103,'airport codes'!$C$3:$C$2103)","v":"Egypt"},"21DEC20",1345,1810,"21DEC20","X",null,null,null,null,null,null,"PAXULD"]
[274,"Austrian Airlines","OS863","VIE",{"$f":"_xlfn.XLOOKUP(' Flight data base'!D275,'airport codes'!$D$3:$D$2103,'airport codes'!$C$3:$C$2103)","v":"Austria"},"CAI",{"$f":"_xlfn.XLOOKUP(' Flight data base'!F275,'airport codes'!$D$3:$D$2103,'airport codes'!$C$3:$C$2103)","v":"Egypt"},"23DEC20",1345,1810,"23DEC20",null,null,"X",null,null,null,null,"PAXULD"]
[275,"Austrian Airlines","OS863","VIE",{"$f":"_xlfn.XLOOKUP(' Flight data base'!D276,'airport codes'!$D$3:$D$2103,'airport codes'!$C$3:$C$2103)","v":"Austria"},"CAI",{"$f":"_xlfn.XLOOKUP(' Flight data base'!F276,'airport codes'!$D$3:$D$2103,'airport codes'!$C$3:$C$2103)","v":"Egypt"},"2021-01-11",1345,1810,"2021-01-11","X",null,null,null,null,null,null,"PAXULD"]
[276,"Austrian Airlines","OS863","VIE",{"$f":"_xlfn.XLOOKUP(' Flight data base'!D277,'airport codes'!$D$3:$D$2103,'airport codes'!$C$3:$C$2103)","v":"Austria"},"CAI",{"$f":"_xlfn.XLOOKUP(' Flight data base'!F277,'airport codes'!$D$3:$D$2103,'airport codes'!$C$3:$C$2103)","v":"Egypt"},"2021-01-13",1345,1810,"2021-01-13",null,null,"X",null,null,null,null,"PAXULD"]
[277,"Brussels Airlines","SN1461","BRU",{"$f":"_xlfn.XLOOKUP(' Flight data base'!D278,'airport codes'!$D$3:$D$2103,'airport codes'!$C$3:$C$2103)","v":"Belgium"},"BJM",{"$f":"_xlfn.XLOOKUP(' Flight data base'!F278,'airport codes'!$D$3:$D$2103,'airport codes'!$C$3:$C$2103)","v":"Burundi"},"2021-01-05",1445,205,"2021-01-05",null,"X",null,null,null,null,null,"PAXULD"]
[278,"Brussels Airlines","SN1461","BRU",{"$f":"_xlfn.XLOOKUP(' Flight data base'!D279,'airport codes'!$D$3:$D$2103,'airport codes'!$C$3:$C$2103)","v":"Belgium"},"KGL",{"$f":"_xlfn.XLOOKUP(' Flight data base'!F279,'airport codes'!$D$3:$D$2103,'airport codes'!$C$3:$C$2103)","v":"Rwanda"},"2021-01-05",1445,5,"2021-01-05",null,"X",null,null,null,null,null,"PAXULD"]
[279,"Brussels Airlines","SN201","BRU",{"$f":"_xlfn.XLOOKUP(' Flight data base'!D280,'airport codes'!$D$3:$D$2103,'airport codes'!$C$3:$C$2103)","v":"Belgium"},"DSS",{"$f":"_xlfn.XLOOKUP(' Flight data base'!F280,'airport codes'!$D$3:$D$2103,'airport codes'!$C$3:$C$2103)","v":"Senegal"},"17DEC20",1525,2040,"17DEC20",null,null,null,"X",null,null,null,"PAXULD"]
[280,"Brussels Airlines","SN201","BRU",{"$f":"_xlfn.XLOOKUP(' Flight data base'!D281,'airport codes'!$D$3:$D$2103,'airport codes'!$C$3:$C$2103)","v":"Belgium"},"DSS",{"$f":"_xlfn.XLOOKUP(' Flight data base'!F281,'airport codes'!$D$3:$D$2103,'airport codes'!$C$3:$C$2103)","v":"Senegal"},"20DEC20",1525,2040,"20DEC20",null,null,null,null,null,null,"X","PAXULD"]
[281,"Brussels Airlines","SN201","BRU",{"$f":"_xlfn.XLOOKUP(' Flight data base'!D282,'airport codes'!$D$3:$D$2103,'airport codes'!$C$3:$C$2103)","v":"Belgium"},"DSS",{"$f":"_xlfn.XLOOKUP(' Flight data base'!F282,'airport codes'!$D$3:$D$2103,'airport codes'!$C$3:$C$2103)","v":"Senegal"},"24DEC20",1525,2040,"11FEB21",null,null,null,"X",null,null,"X","PAXULD"]
[282,"Brussels Airlines","SN217","BRU",{"$f":"_xlfn.XLOOKUP(' Flight data base'!D283,'airport codes'!$D$3:$D$2103,'airport codes'!$C$3:$C$2103)","v":"Belgium"},"BJL",{"$f":"_xlfn.XLOOKUP(' Flight data base'!F283,'airport codes'!$D$3:$D$2103,'airport codes'!$C$3:$C$2103)","v":"Gambia"},"2021-01-01",1515,2045,"2021-01-04","X",null,null,null,"X",null,null,"PAXULD"]
[283,"Brussels Airlines","SN217","BRU",{"$f":"_xlfn.XLOOKUP(' Flight data base'!D284,'airport codes'!$D$3:$D$2103,'airport codes'!$C$3:$C$2103)","v":"Belgium"},"DSS",{"$f":"_xlfn.XLOOKUP(' Flight data base'!F284,'airport codes'!$D$3:$D$2103,'airport codes'!$C$3:$C$2103)","v":"Senegal"},"2021-01-01",1515,2235,"2021-01-04","X",null,null,null,"X",null,null,"PAXULD"]
[284,"Brussels Airlines","SN217","BRU",{"$f":"_xlfn.XLOOKUP(' Flight data base'!D285,'airport codes'!$D$3:$D$2103,'airport codes'!$C$3:$C$2103)","v":"Belgium"},"BJL",{"$f":"_xlfn.XLOOKUP(' Flight data base'!F285,'airport codes'!$D$3:$D$2103,'airport codes'!$C$3:$C$2103)","v":"Gambia"},"2021-01-06",1515,2045,"2021-01-13",null,null,"X",null,null,null,null,"PAXULD"]
[285,"Brussels Airlines","SN217","BRU",{"$f":"_xlfn.XLOOKUP(' Flight data base'!D286,'airport codes'!$D$3:$D$2103,'airport codes'!$C$3:$C$2103)","v":"Belgium"},"DSS",{"$f":"_xlfn.XLOOKUP(' Flight data base'!F286,'airport codes'!$D$3:$D$2103,'airport codes'!$C$3:$C$2103)","v":"Senegal"},"2021-01-06",1515,2235,"2021-01-13",null,null,"X",null,null,null,null,"PAXULD"]
[286,"Brussels Airlines","SN217","BRU",{"$f":"_xlfn.XLOOKUP(' Flight data base'!D287,'airport codes'!$D$3:$D$2103,'airport codes'!$C$3:$C$2103)","v":"Belgium"},"BJL",{"$f":"_xlfn.XLOOKUP(' Flight data base'!F287,'airport codes'!$D$3:$D$2103,'airport codes'!$C$3:$C$2103)","v":"Gambia"},"2021-01-08",1515,2045,"2021-01-15","X",null,null,null,"X",null,null,"PAXULD"]
[287,"Brussels Airlines","SN217","BRU",{"$f":"_xlfn.XLOOKUP(' Flight data base'!D288,'airport codes'!$D$3:$D$2103,'airport codes'!$C$3:$C$2103)","v":"Belgium"},"DSS",{"$f":"_xlfn.XLOOKUP(' Flight data base'!F288,'airport codes'!$D$3:$D$2103,'airport codes'!$C$3:$C$2103)","v":"Senegal"},"2021-01-08",1515,2235,"2021-01-15","X",null,null,null,"X",null,null,"PAXULD"]
[288,"Brussels Airlines","SN217","BRU",{"$f":"_xlfn.XLOOKUP(' Flight data base'!D289,'airport codes'!$D$3:$D$2103,'airport codes'!$C$3:$C$2103)","v":"Belgium"},"BJL",{"$f":"_xlfn.XLOOKUP(' Flight data base'!F289,'airport codes'!$D$3:$D$2103,'airport codes'!$C$3:$C$2103)","v":"Gambia"},"23DEC20",1515,2045,"30DEC20",null,null,"X",null,null,null,null,"PAXULD"]
[289,"Brussels Airlines","SN217","BRU",{"$f":"_xlfn.XLOOKUP(' Flight data base'!D290,'airport codes'!$D$3:$D$2103,'airport codes'!$C$3:$C$2103)","v":"Belgium"},"DSS",{"$f":"_xlfn.XLOOKUP(' Flight data base'!F290,'airport codes'!$D$3:$D$2103,'airport codes'!$C$3:$C$2103)","v":"Senegal"},"23DEC20",1515,2235,"30DEC20",null,null,"X",null,null,null,null,"PAXULD"]
[290,"Brussels Airlines","SN217","BRU",{"$f":"_xlfn.XLOOKUP(' Flight data base'!D291,'airport codes'!$D$3:$D$2103,'airport codes'!$C$3:$C$2103)","v":"Belgium"},"BJL",{"$f":"_xlfn.XLOOKUP(' Flight data base'!F291,'airport codes'!$D$3:$D$2103,'airport codes'!$C$3:$C$2103)","v":"Gambia"},"16DEC20",1515,2045,"16DEC20",null,null,"X",null,null,null,null,"PAXULD"]
[291,"Brussels Airlines","SN217","BRU",{"$f":"_xlfn.XLOOKUP(' Flight data base'!D292,'airport codes'!$D$3:$D$2103,'airport codes'!$C$3:$C$2103)","v":"Belgium"},"DSS",{"$f":"_xlfn.XLOOKUP(' Flight data base'!F292,'airport codes'!$D$3:$D$2103,'airport codes'!$C$3:$C$2103)","v":"Senegal"},"16DEC20",1515,2235,"16DEC20",null,null,"X",null,null,null,null,"PAXULD"]
[292,"Brussels Airlines","SN217","BRU",{"$f":"_xlfn.XLOOKUP(' Flight data base'!D293,'airport codes'!$D$3:$D$2103,'airport codes'!$C$3:$C$2103)","v":"Belgium"},"BJL",{"$f":"_xlfn.XLOOKUP(' Flight data base'!F293,'airport codes'!$D$3:$D$2103,'airport codes'!$C$3:$C$2103)","v":"Gambia"},"25DEC20",1515,2045,"25DEC20",null,null,null,null,"X",null,null,"PAXULD"]
[293,"Brussels Airlines","SN217","BRU",{"$f":"_xlfn.XLOOKUP(' Flight data base'!D294,'airport codes'!$D$3:$D$2103,'airport codes'!$C$3:$C$2103)","v":"Belgium"},"DSS",{"$f":"_xlfn.XLOOKUP(' Flight data base'!F294,'airport codes'!$D$3:$D$2103,'airport codes'!$C$3:$C$2103)","v":"Senegal"},"25DEC20",1515,2235,"25DEC20",null,null,null,null,"X",null,null,"PAXULD"]
[294,"Brussels Airlines","SN217","BRU",{"$f":"_xlfn.XLOOKUP(' Flight data base'!D295,'airport codes'!$D$3:$D$2103,'airport codes'!$C$3:$C$2103)","v":"Belgium"},"BJL",{"$f":"_xlfn.XLOOKUP(' Flight data base'!F295,'airport codes'!$D$3:$D$2103,'airport codes'!$C$3:$C$2103)","v":"Gambia"},"21DEC20",1515,2045,"21DEC20","X",null,null,null,null,null,null,"PAXULD"]
[295,"Brussels Airlines","SN217","BRU",{"$f":"_xlfn.XLOOKUP(' Flight data base'!D296,'airport codes'!$D$3:$D$2103,'airport codes'!$C$3:$C$2103)","v":"Belgium"},"DSS",{"$f":"_xlfn.XLOOKUP(' Flight data base'!F296,'airport codes'!$D$3:$D$2103,'airport codes'!$C$3:$C$2103)","v":"Senegal"},"21DEC20",1515,2235,"21DEC20","X",null,null,null,null,null,null,"PAXULD"]
[296,"Brussels Airlines","SN217","BRU",{"$f":"_xlfn.XLOOKUP(' Flight data base'!D297,'airport codes'!$D$3:$D$2103,'airport codes'!$C$3:$C$2103)","v":"Belgium"},"BJL",{"$f":"_xlfn.XLOOKUP(' Flight data base'!F297,'airport codes'!$D$3:$D$2103,'airport codes'!$C$3:$C$2103)","v":"Gambia"},"28DEC20",1515,2045,"28DEC20","X",null,null,null,null,null,null,"PAXULD"]
[297,"Brussels Airlines","SN217","BRU",{"$f":"_xlfn.XLOOKUP(' Flight data base'!D298,'airport codes'!$D$3:$D$2103,'airport codes'!$C$3:$C$2103)","v":"Belgium"},"DSS",{"$f":"_xlfn.XLOOKUP(' Flight data base'!F298,'airport codes'!$D$3:$D$2103,'airport codes'!$C$3:$C$2103)","v":"Senegal"},"28DEC20",1515,2235,"28DEC20","X",null,null,null,null,null,null,"PAXULD"]
[298,"Brussels Airlines","SN217","BRU",{"$f":"_xlfn.XLOOKUP(' Flight data base'!D299,'airport codes'!$D$3:$D$2103,'airport codes'!$C$3:$C$2103)","v":"Belgium"},"BJL",{"$f":"_xlfn.XLOOKUP(' Flight data base'!F299,'airport codes'!$D$3:$D$2103,'airport codes'!$C$3:$C$2103)","v":"Gambia"},"18DEC20",1515,2045,"18DEC20",null,null,null,null,"X",null,null,"PAXULD"]
[299,"Brussels Airlines","SN221","BRU",{"$f":"_xlfn.XLOOKUP(' Flight data base'!D300,'airport codes'!$D$3:$D$2103,'airport codes'!$C$3:$C$2103)","v":"Belgium"},"BJL",{"$f":"_xlfn.XLOOKUP(' Flight data base'!F300,'airport codes'!$D$3:$D$2103,'airport codes'!$C$3:$C$2103)","v":"Gambia"},"2021-01-02",1515,2045,"2021-01-02",null,null,null,null,null,"X",null,"PAXULD"]
[300,"Brussels Airlines","SN221","BRU",{"$f":"_xlfn.XLOOKUP(' Flight data base'!D301,'airport codes'!$D$3:$D$2103,'airport codes'!$C$3:$C$2103)","v":"Belgium"},"DSS",{"$f":"_xlfn.XLOOKUP(' Flight data base'!F301,'airport codes'!$D$3:$D$2103,'airport codes'!$C$3:$C$2103)","v":"Senegal"},"2021-01-02",1515,2235,"2021-01-02",null,null,null,null,null,"X",null,"PAXULD"]
[301,"Brussels Airlines","SN221","BRU",{"$f":"_xlfn.XLOOKUP(' Flight data base'!D302,'airport codes'!$D$3:$D$2103,'airport codes'!$C$3:$C$2103)","v":"Belgium"},"BJL",{"$f":"_xlfn.XLOOKUP(' Flight data base'!F302,'airport codes'!$D$3:$D$2103,'airport codes'!$C$3:$C$2103)","v":"Gambia"},"2021-01-09",1515,2045,"2021-01-09",null,null,null,null,null,"X",null,"PAXULD"]
[302,"Brussels Airlines","SN221","BRU",{"$f":"_xlfn.XLOOKUP(' Flight data base'!D303,'airport codes'!$D$3:$D$2103,'airport codes'!$C$3:$C$2103)","v":"Belgium"},"DSS",{"$f":"_xlfn.XLOOKUP(' Flight data base'!F303,'airport codes'!$D$3:$D$2103,'airport codes'!$C$3:$C$2103)","v":"Senegal"},"2021-01-09",1515,2235,"2021-01-09",null,null,null,null,null,"X",null,"PAXULD"]
[303,"Brussels Airlines","SN221","BRU",{"$f":"_xlfn.XLOOKUP(' Flight data base'!D304,'airport codes'!$D$3:$D$2103,'airport codes'!$C$3:$C$2103)","v":"Belgium"},"BJL",{"$f":"_xlfn.XLOOKUP(' Flight data base'!F304,'airport codes'!$D$3:$D$2103,'airport codes'!$C$3:$C$2103)","v":"Gambia"},"19DEC20",1515,2045,"19DEC20",null,null,null,null,null,"X",null,"PAXULD"]
[304,"Brussels Airlines","SN221","BRU",{"$f":"_xlfn.XLOOKUP(' Flight data base'!D305,'airport codes'!$D$3:$D$2103,'airport codes'!$C$3:$C$2103)","v":"Belgium"},"DSS",{"$f":"_xlfn.XLOOKUP(' Flight data base'!F305,'airport codes'!$D$3:$D$2103,'airport codes'!$C$3:$C$2103)","v":"Senegal"},"19DEC20",1515,2235,"19DEC20",null,null,null,null,null,"X",null,"PAXULD"]
[305,"Brussels Airlines","SN221","BRU",{"$f":"_xlfn.XLOOKUP(' Flight data base'!D306,'airport codes'!$D$3:$D$2103,'airport codes'!$C$3:$C$2103)","v":"Belgium"},"BJL",{"$f":"_xlfn.XLOOKUP(' Flight data base'!F306,'airport codes'!$D$3:$D$2103,'airport codes'!$C$3:$C$2103)","v":"Gambia"},"26DEC20",1515,2045,"26DEC20",null,null,null,null,null,"X",null,"PAXULD"]
[306,"Brussels Airlines","SN221","BRU",{"$f":"_xlfn.XLOOKUP(' Flight data base'!D307,'airport codes'!$D$3:$D$2103,'airport codes'!$C$3:$C$2103)","v":"Belgium"},"DSS",{"$f":"_xlfn.XLOOKUP(' Flight data base'!F307,'airport codes'!$D$3:$D$2103,'airport codes'!$C$3:$C$2103)","v":"Senegal"},"26DEC20",1515,2235,"26DEC20",null,null,null,null,null,"X",null,"PAXULD"]
[307,"Brussels Airlines","SN231","BRU",{"$f":"_xlfn.XLOOKUP(' Flight data base'!D308,'airport codes'!$D$3:$D$2103,'airport codes'!$C$3:$C$2103)","v":"Belgium"},"COO",{"$f":"_xlfn.XLOOKUP(' Flight data base'!F308,'airport codes'!$D$3:$D$2103,'airport codes'!$C$3:$C$2103)","v":"Benin"},"2021-01-01",1450,2130,"2021-01-05",null,"X",null,null,"X",null,null,"PAXULD"]
[308,"Brussels Airlines","SN231","BRU",{"$f":"_xlfn.XLOOKUP(' Flight data base'!D309,'airport codes'!$D$3:$D$2103,'airport codes'!$C$3:$C$2103)","v":"Belgium"},"ABJ",{"$f":"_xlfn.XLOOKUP(' Flight data base'!F309,'airport codes'!$D$3:$D$2103,'airport codes'!$C$3:$C$2103)","v":"Cote d'Ivoire"},"2021-01-01",1450,2255,"2021-01-05",null,"X",null,null,"X",null,null,"PAXULD"]
[309,"Brussels Airlines","SN231","BRU",{"$f":"_xlfn.XLOOKUP(' Flight data base'!D310,'airport codes'!$D$3:$D$2103,'airport codes'!$C$3:$C$2103)","v":"Belgium"},"COO",{"$f":"_xlfn.XLOOKUP(' Flight data base'!F310,'airport codes'!$D$3:$D$2103,'airport codes'!$C$3:$C$2103)","v":"Benin"},"22DEC20",1450,2130,"29DEC20",null,"X",null,null,null,null,null,"PAXULD"]
[310,"Brussels Airlines","SN231","BRU",{"$f":"_xlfn.XLOOKUP(' Flight data base'!D311,'airport codes'!$D$3:$D$2103,'airport codes'!$C$3:$C$2103)","v":"Belgium"},"ABJ",{"$f":"_xlfn.XLOOKUP(' Flight data base'!F311,'airport codes'!$D$3:$D$2103,'airport codes'!$C$3:$C$2103)","v":"Cote d'Ivoire"},"22DEC20",1450,2255,"29DEC20",null,"X",null,null,null,null,null,"PAXULD"]
[311,"Brussels Airlines","SN231","BRU",{"$f":"_xlfn.XLOOKUP(' Flight data base'!D312,'airport codes'!$D$3:$D$2103,'airport codes'!$C$3:$C$2103)","v":"Belgium"},"COO",{"$f":"_xlfn.XLOOKUP(' Flight data base'!F312,'airport codes'!$D$3:$D$2103,'airport codes'!$C$3:$C$2103)","v":"Benin"},"2021-01-08",1450,2130,"2021-01-08",null,null,null,null,"X",null,null,"PAXULD"]
[312,"Brussels Airlines","SN231","BRU",{"$f":"_xlfn.XLOOKUP(' Flight data base'!D313,'airport codes'!$D$3:$D$2103,'airport codes'!$C$3:$C$2103)","v":"Belgium"},"ABJ",{"$f":"_xlfn.XLOOKUP(' Flight data base'!F313,'airport codes'!$D$3:$D$2103,'airport codes'!$C$3:$C$2103)","v":"Cote d'Ivoire"},"2021-01-08",1450,2255,"2021-01-08",null,null,null,null,"X",null,null,"PAXULD"]
[313,"Brussels Airlines","SN231","BRU",{"$f":"_xlfn.XLOOKUP(' Flight data base'!D314,'airport codes'!$D$3:$D$2103,'airport codes'!$C$3:$C$2103)","v":"Belgium"},"COO",{"$f":"_xlfn.XLOOKUP(' Flight data base'!F314,'airport codes'!$D$3:$D$2103,'airport codes'!$C$3:$C$2103)","v":"Benin"},"15DEC20",1450,2130,"15DEC20",null,"X",null,null,null,null,null,"PAXULD"]
[314,"Brussels Airlines","SN231","BRU",{"$f":"_xlfn.XLOOKUP(' Flight data base'!D315,'airport codes'!$D$3:$D$2103,'airport codes'!$C$3:$C$2103)","v":"Belgium"},"ABJ",{"$f":"_xlfn.XLOOKUP(' Flight data base'!F315,'airport codes'!$D$3:$D$2103,'airport codes'!$C$3:$C$2103)","v":"Cote d'Ivoire"},"15DEC20",1450,2255,"15DEC20",null,"X",null,null,null,null,null,"PAXULD"]
[315,"Brussels Airlines","SN231","BRU",{"$f":"_xlfn.XLOOKUP(' Flight data base'!D316,'airport codes'!$D$3:$D$2103,'airport codes'!$C$3:$C$2103)","v":"Belgium"},"COO",{"$f":"_xlfn.XLOOKUP(' Flight data base'!F316,'airport codes'!$D$3:$D$2103,'airport codes'!$C$3:$C$2103)","v":"Benin"},"18DEC20",1450,2130,"18DEC20",null,null,null,null,"X",null,null,"PAXULD"]
[316,"Brussels Airlines","SN231","BRU",{"$f":"_xlfn.XLOOKUP(' Flight data base'!D317,'airport codes'!$D$3:$D$2103,'airport codes'!$C$3:$C$2103)","v":"Belgium"},"ABJ",{"$f":"_xlfn.XLOOKUP(' Flight data base'!F317,'airport codes'!$D$3:$D$2103,'airport codes'!$C$3:$C$2103)","v":"Cote d'Ivoire"},"18DEC20",1450,2255,"18DEC20",null,null,null,null,"X",null,null,"PAXULD"]
[317,"Brussels Airlines","SN231","BRU",{"$f":"_xlfn.XLOOKUP(' Flight data base'!D318,'airport codes'!$D$3:$D$2103,'airport codes'!$C$3:$C$2103)","v":"Belgium"},"COO",{"$f":"_xlfn.XLOOKUP(' Flight data base'!F318,'airport codes'!$D$3:$D$2103,'airport codes'!$C$3:$C$2103)","v":"Benin"},"25DEC20",1450,2130,"25DEC20",null,null,null,null,"X",null,null,"PAXULD"]
[318,"Brussels Airlines","SN231","BRU",{"$f":"_xlfn.XLOOKUP(' Flight data base'!D319,'airport codes'!$D$3:$D$2103,'airport codes'!$C$3:$C$2103)","v":"Belgium"},"ABJ",{"$f":"_xlfn.XLOOKUP(' Flight data base'!F319,'airport codes'!$D$3:$D$2103,'airport codes'!$C$3:$C$2103)","v":"Cote d'Ivoire"},"25DEC20",1450,2255,"25DEC20",null,null,null,null,"X",null,null,"PAXULD"]
[319,"Brussels Airlines","SN231","BRU",{"$f":"_xlfn.XLOOKUP(' Flight data base'!D320,'airport codes'!$D$3:$D$2103,'airport codes'!$C$3:$C$2103)","v":"Belgium"},"COO",{"$f":"_xlfn.XLOOKUP(' Flight data base'!F320,'airport codes'!$D$3:$D$2103,'airport codes'!$C$3:$C$2103)","v":"Benin"},"2021-01-12",1450,2130,"2021-01-12",null,"X",null,null,null,null,null,"PAXULD"]
[320,"Brussels Airlines","SN231","BRU",{"$f":"_xlfn.XLOOKUP(' Flight data base'!D321,'airport codes'!$D$3:$D$2103,'airport codes'!$C$3:$C$2103)","v":"Belgium"},"ABJ",{"$f":"_xlfn.XLOOKUP(' Flight data base'!F321,'airport codes'!$D$3:$D$2103,'airport codes'!$C$3:$C$2103)","v":"Cote d'Ivoire"},"2021-01-12",1450,2255,"2021-01-12",null,"X",null,null,null,null,null,"PAXULD"]
[321,"Brussels Airlines","SN241","BRU",{"$f":"_xlfn.XLOOKUP(' Flight data base'!D322,'airport codes'!$D$3:$D$2103,'airport codes'!$C$3:$C$2103)","v":"Belgium"},"FNA",{"$f":"_xlfn.XLOOKUP(' Flight data base'!F322,'airport codes'!$D$3:$D$2103,'airport codes'!$C$3:$C$2103)","v":"Sierra Leone"},"2021-01-01",1440,2020,"2021-01-01",null,null,null,null,"X",null,null,"PAXULD"]
[322,"Brussels Airlines","SN241","BRU",{"$f":"_xlfn.XLOOKUP(' Flight data base'!D323,'airport codes'!$D$3:$D$2103,'airport codes'!$C$3:$C$2103)","v":"Belgium"},"ROB",{"$f":"_xlfn.XLOOKUP(' Flight data base'!F323,'airport codes'!$D$3:$D$2103,'airport codes'!$C$3:$C$2103)","v":"Liberia"},"2021-01-01",1440,2240,"2021-01-01",null,null,null,null,"X",null,null,"PAXULD"]
[323,"Brussels Airlines","SN241","BRU",{"$f":"_xlfn.XLOOKUP(' Flight data base'!D324,'airport codes'!$D$3:$D$2103,'airport codes'!$C$3:$C$2103)","v":"Belgium"},"FNA",{"$f":"_xlfn.XLOOKUP(' Flight data base'!F324,'airport codes'!$D$3:$D$2103,'airport codes'!$C$3:$C$2103)","v":"Sierra Leone"},"2021-01-03",1440,2020,"2021-01-03",null,null,null,null,null,null,"X","PAXULD"]
[324,"Brussels Airlines","SN241","BRU",{"$f":"_xlfn.XLOOKUP(' Flight data base'!D325,'airport codes'!$D$3:$D$2103,'airport codes'!$C$3:$C$2103)","v":"Belgium"},"ROB",{"$f":"_xlfn.XLOOKUP(' Flight data base'!F325,'airport codes'!$D$3:$D$2103,'airport codes'!$C$3:$C$2103)","v":"Liberia"},"2021-01-03",1440,2240,"2021-01-03",null,null,null,null,null,null,"X","PAXULD"]
[325,"Brussels Airlines","SN241","BRU",{"$f":"_xlfn.XLOOKUP(' Flight data base'!D326,'airport codes'!$D$3:$D$2103,'airport codes'!$C$3:$C$2103)","v":"Belgium"},"FNA",{"$f":"_xlfn.XLOOKUP(' Flight data base'!F326,'airport codes'!$D$3:$D$2103,'airport codes'!$C$3:$C$2103)","v":"Sierra Leone"},"2021-01-06",1440,2020,"2021-01-15",null,null,"X",null,"X",null,null,"PAXULD"]
[326,"Brussels Airlines","SN241","BRU",{"$f":"_xlfn.XLOOKUP(' Flight data base'!D327,'airport codes'!$D$3:$D$2103,'airport codes'!$C$3:$C$2103)","v":"Belgium"},"ROB",{"$f":"_xlfn.XLOOKUP(' Flight data base'!F327,'airport codes'!$D$3:$D$2103,'airport codes'!$C$3:$C$2103)","v":"Liberia"},"2021-01-06",1440,2240,"2021-01-15",null,null,"X",null,"X",null,null,"PAXULD"]
[327,"Brussels Airlines","SN241","BRU",{"$f":"_xlfn.XLOOKUP(' Flight data base'!D328,'airport codes'!$D$3:$D$2103,'airport codes'!$C$3:$C$2103)","v":"Belgium"},"FNA",{"$f":"_xlfn.XLOOKUP(' Flight data base'!F328,'airport codes'!$D$3:$D$2103,'airport codes'!$C$3:$C$2103)","v":"Sierra Leone"},"2021-01-10",1440,2020,"2021-01-10",null,null,null,null,null,null,"X","PAXULD"]
[328,"Brussels Airlines","SN241","BRU",{"$f":"_xlfn.XLOOKUP(' Flight data base'!D329,'airport codes'!$D$3:$D$2103,'airport codes'!$C$3:$C$2103)","v":"Belgium"},"ROB",{"$f":"_xlfn.XLOOKUP(' Flight data base'!F329,'airport codes'!$D$3:$D$2103,'airport codes'!$C$3:$C$2103)","v":"Liberia"},"2021-01-10",1440,2240,"2021-01-10",null,null,null,null,null,null,"X","PAXULD"]
[329,"Brussels Airlines","SN241","BRU",{"$f":"_xlfn.XLOOKUP(' Flight data base'!D330,'airport codes'!$D$3:$D$2103,'airport codes'!$C$3:$C$2103)","v":"Belgium"},"FNA",{"$f":"_xlfn.XLOOKUP(' Flight data base'!F330,'airport codes'!$D$3:$D$2103,'airport codes'!$C$3:$C$2103)","v":"Sierra Leone"},"18DEC20",1440,2020,"18DEC20",null,null,null,null,"X",null,null,"PAXULD"]
[330,"Brussels Airlines","SN241","BRU",{"$f":"_xlfn.XLOOKUP(' Flight data base'!D331,'airport codes'!$D$3:$D$2103,'airport codes'!$C$3:$C$2103)","v":"Belgium"},"ROB",{"$f":"_xlfn.XLOOKUP(' Flight data base'!F331,'airport codes'!$D$3:$D$2103,'airport codes'!$C$3:$C$2103)","v":"Liberia"},"18DEC20",1440,2240,"18DEC20",null,null,null,null,"X",null,null,"PAXULD"]
[331,"Brussels Airlines","SN241","BRU",{"$f":"_xlfn.XLOOKUP(' Flight data base'!D332,'airport codes'!$D$3:$D$2103,'airport codes'!$C$3:$C$2103)","v":"Belgium"},"FNA",{"$f":"_xlfn.XLOOKUP(' Flight data base'!F332,'airport codes'!$D$3:$D$2103,'airport codes'!$C$3:$C$2103)","v":"Sierra Leone"},"23DEC20",1440,2020,"30DEC20",null,null,"X",null,"X",null,null,"PAXULD"]
[332,"Brussels Airlines","SN241","BRU",{"$f":"_xlfn.XLOOKUP(' Flight data base'!D333,'airport codes'!$D$3:$D$2103,'airport codes'!$C$3:$C$2103)","v":"Belgium"},"ROB",{"$f":"_xlfn.XLOOKUP(' Flight data base'!F333,'airport codes'!$D$3:$D$2103,'airport codes'!$C$3:$C$2103)","v":"Liberia"},"23DEC20",1440,2240,"30DEC20",null,null,"X",null,"X",null,null,"PAXULD"]
[333,"Brussels Airlines","SN241","BRU",{"$f":"_xlfn.XLOOKUP(' Flight data base'!D334,'airport codes'!$D$3:$D$2103,'airport codes'!$C$3:$C$2103)","v":"Belgium"},"FNA",{"$f":"_xlfn.XLOOKUP(' Flight data base'!F334,'airport codes'!$D$3:$D$2103,'airport codes'!$C$3:$C$2103)","v":"Sierra Leone"},"16DEC20",1440,2020,"16DEC20",null,null,"X",null,null,null,null,"PAXULD"]
[334,"Brussels Airlines","SN241","BRU",{"$f":"_xlfn.XLOOKUP(' Flight data base'!D335,'airport codes'!$D$3:$D$2103,'airport codes'!$C$3:$C$2103)","v":"Belgium"},"FNA",{"$f":"_xlfn.XLOOKUP(' Flight data base'!F335,'airport codes'!$D$3:$D$2103,'airport codes'!$C$3:$C$2103)","v":"Sierra Leone"},"20DEC20",1440,2020,"20DEC20",null,null,null,null,null,null,"X","PAXULD"]
[335,"Brussels Airlines","SN241","BRU",{"$f":"_xlfn.XLOOKUP(' Flight data base'!D336,'airport codes'!$D$3:$D$2103,'airport codes'!$C$3:$C$2103)","v":"Belgium"},"ROB",{"$f":"_xlfn.XLOOKUP(' Flight data base'!F336,'airport codes'!$D$3:$D$2103,'airport codes'!$C$3:$C$2103)","v":"Liberia"},"20DEC20",1440,2240,"20DEC20",null,null,null,null,null,null,"X","PAXULD"]
[336,"Brussels Airlines","SN241","BRU",{"$f":"_xlfn.XLOOKUP(' Flight data base'!D337,'airport codes'!$D$3:$D$2103,'airport codes'!$C$3:$C$2103)","v":"Belgium"},"FNA",{"$f":"_xlfn.XLOOKUP(' Flight data base'!F337,'airport codes'!$D$3:$D$2103,'airport codes'!$C$3:$C$2103)","v":"Sierra Leone"},"27DEC20",1440,2020,"27DEC20",null,null,null,null,null,null,"X","PAXULD"]
[337,"Brussels Airlines","SN241","BRU",{"$f":"_xlfn.XLOOKUP(' Flight data base'!D338,'airport codes'!$D$3:$D$2103,'airport codes'!$C$3:$C$2103)","v":"Belgium"},"ROB",{"$f":"_xlfn.XLOOKUP(' Flight data base'!F338,'airport codes'!$D$3:$D$2103,'airport codes'!$C$3:$C$2103)","v":"Liberia"},"27DEC20",1440,2240,"27DEC20",null,null,null,null,null,null,"X","PAXULD"]
[338,"Brussels Airlines","SN243","BRU",{"$f":"_xlfn.XLOOKUP(' Flight data base'!D339,'airport codes'!$D$3:$D$2103,'airport codes'!$C$3:$C$2103)","v":"Belgium"},"FNA",{"$f":"_xlfn.XLOOKUP(' Flight data base'!F339,'airport codes'!$D$3:$D$2103,'airport codes'!$C$3:$C$2103)","v":"Sierra Leone"},"2021-01-05",1440,2020,"2021-01-05",null,"X",null,null,null,null,null,"PAXULD"]
[339,"Brussels Airlines","SN243","BRU",{"$f":"_xlfn.XLOOKUP(' Flight data base'!D340,'airport codes'!$D$3:$D$2103,'airport codes'!$C$3:$C$2103)","v":"Belgium"},"ROB",{"$f":"_xlfn.XLOOKUP(' Flight data base'!F340,'airport codes'!$D$3:$D$2103,'airport codes'!$C$3:$C$2103)","v":"Liberia"},"2021-01-05",1440,2240,"2021-01-05",null,"X",null,null,null,null,null,"PAXULD"]
[340,"Brussels Airlines","SN243","BRU",{"$f":"_xlfn.XLOOKUP(' Flight data base'!D341,'airport codes'!$D$3:$D$2103,'airport codes'!$C$3:$C$2103)","v":"Belgium"},"FNA",{"$f":"_xlfn.XLOOKUP(' Flight data base'!F341,'airport codes'!$D$3:$D$2103,'airport codes'!$C$3:$C$2103)","v":"Sierra Leone"},"15DEC20",1440,2020,"15DEC20",null,"X",null,null,null,null,null,"PAXULD"]
[341,"Brussels Airlines","SN243","BRU",{"$f":"_xlfn.XLOOKUP(' Flight data base'!D342,'airport codes'!$D$3:$D$2103,'airport codes'!$C$3:$C$2103)","v":"Belgium"},"ROB",{"$f":"_xlfn.XLOOKUP(' Flight data base'!F342,'airport codes'!$D$3:$D$2103,'airport codes'!$C$3:$C$2103)","v":"Liberia"},"15DEC20",1440,2240,"15DEC20",null,"X",null,null,null,null,null,"PAXULD"]
[342,"Brussels Airlines","SN243","BRU",{"$f":"_xlfn.XLOOKUP(' Flight data base'!D343,'airport codes'!$D$3:$D$2103,'airport codes'!$C$3:$C$2103)","v":"Belgium"},"FNA",{"$f":"_xlfn.XLOOKUP(' Flight data base'!F343,'airport codes'!$D$3:$D$2103,'airport codes'!$C$3:$C$2103)","v":"Sierra Leone"},"17DEC20",1440,2020,"17DEC20",null,null,null,"X",null,null,null,"PAXULD"]
[343,"Brussels Airlines","SN243","BRU",{"$f":"_xlfn.XLOOKUP(' Flight data base'!D344,'airport codes'!$D$3:$D$2103,'airport codes'!$C$3:$C$2103)","v":"Belgium"},"ROB",{"$f":"_xlfn.XLOOKUP(' Flight data base'!F344,'airport codes'!$D$3:$D$2103,'airport codes'!$C$3:$C$2103)","v":"Liberia"},"17DEC20",1440,2240,"17DEC20",null,null,null,"X",null,null,null,"PAXULD"]
[344,"Brussels Airlines","SN243","BRU",{"$f":"_xlfn.XLOOKUP(' Flight data base'!D345,'airport codes'!$D$3:$D$2103,'airport codes'!$C$3:$C$2103)","v":"Belgium"},"FNA",{"$f":"_xlfn.XLOOKUP(' Flight data base'!F345,'airport codes'!$D$3:$D$2103,'airport codes'!$C$3:$C$2103)","v":"Sierra Leone"},"2021-01-12",1440,2020,"2021-01-12",null,"X",null,null,null,null,null,"PAXULD"]
[345,"Brussels Airlines","SN243","BRU",{"$f":"_xlfn.XLOOKUP(' Flight data base'!D346,'airport codes'!$D$3:$D$2103,'airport codes'!$C$3:$C$2103)","v":"Belgium"},"ROB",{"$f":"_xlfn.XLOOKUP(' Flight data base'!F346,'airport codes'!$D$3:$D$2103,'airport codes'!$C$3:$C$2103)","v":"Liberia"},"2021-01-12",1440,2240,"2021-01-12",null,"X",null,null,null,null,null,"PAXULD"]
[346,"Brussels Airlines","SN245","BRU",{"$f":"_xlfn.XLOOKUP(' Flight data base'!D347,'airport codes'!$D$3:$D$2103,'airport codes'!$C$3:$C$2103)","v":"Belgium"},"FNA",{"$f":"_xlfn.XLOOKUP(' Flight data base'!F347,'airport codes'!$D$3:$D$2103,'airport codes'!$C$3:$C$2103)","v":"Sierra Leone"},"2021-01-11",1440,2020,"2021-01-25","X",null,null,null,null,null,null,"PAXULD"]
[347,"Brussels Airlines","SN245","BRU",{"$f":"_xlfn.XLOOKUP(' Flight data base'!D348,'airport codes'!$D$3:$D$2103,'airport codes'!$C$3:$C$2103)","v":"Belgium"},"ROB",{"$f":"_xlfn.XLOOKUP(' Flight data base'!F348,'airport codes'!$D$3:$D$2103,'airport codes'!$C$3:$C$2103)","v":"Liberia"},"2021-01-11",1440,2240,"2021-01-25","X",null,null,null,null,null,null,"PAXULD"]
[348,"Brussels Airlines","SN245","BRU",{"$f":"_xlfn.XLOOKUP(' Flight data base'!D349,'airport codes'!$D$3:$D$2103,'airport codes'!$C$3:$C$2103)","v":"Belgium"},"FNA",{"$f":"_xlfn.XLOOKUP(' Flight data base'!F349,'airport codes'!$D$3:$D$2103,'airport codes'!$C$3:$C$2103)","v":"Sierra Leone"},"21DEC20",1440,2020,"21DEC20","X",null,null,null,null,null,null,"PAXULD"]
[349,"Brussels Airlines","SN245","BRU",{"$f":"_xlfn.XLOOKUP(' Flight data base'!D350,'airport codes'!$D$3:$D$2103,'airport codes'!$C$3:$C$2103)","v":"Belgium"},"ROB",{"$f":"_xlfn.XLOOKUP(' Flight data base'!F350,'airport codes'!$D$3:$D$2103,'airport codes'!$C$3:$C$2103)","v":"Liberia"},"21DEC20",1440,2240,"21DEC20","X",null,null,null,null,null,null,"PAXULD"]
[350,"Brussels Airlines","SN245","BRU",{"$f":"_xlfn.XLOOKUP(' Flight data base'!D351,'airport codes'!$D$3:$D$2103,'airport codes'!$C$3:$C$2103)","v":"Belgium"},"FNA",{"$f":"_xlfn.XLOOKUP(' Flight data base'!F351,'airport codes'!$D$3:$D$2103,'airport codes'!$C$3:$C$2103)","v":"Sierra Leone"},"28DEC20",1440,2020,"2021-01-04","X",null,null,null,null,null,null,"PAXULD"]
[351,"Brussels Airlines","SN245","BRU",{"$f":"_xlfn.XLOOKUP(' Flight data base'!D352,'airport codes'!$D$3:$D$2103,'airport codes'!$C$3:$C$2103)","v":"Belgium"},"ROB",{"$f":"_xlfn.XLOOKUP(' Flight data base'!F352,'airport codes'!$D$3:$D$2103,'airport codes'!$C$3:$C$2103)","v":"Liberia"},"28DEC20",1440,2240,"2021-01-04","X",null,null,null,null,null,null,"PAXULD"]
[352,"Brussels Airlines","SN253","BRU",{"$f":"_xlfn.XLOOKUP(' Flight data base'!D353,'airport codes'!$D$3:$D$2103,'airport codes'!$C$3:$C$2103)","v":"Belgium"},"LFW",{"$f":"_xlfn.XLOOKUP(' Flight data base'!F353,'airport codes'!$D$3:$D$2103,'airport codes'!$C$3:$C$2103)","v":"Togo"},"27DEC20",1450,2040,"2021-01-03",null,null,null,null,null,null,"X","PAXULD"]
[353,"Brussels Airlines","SN253","BRU",{"$f":"_xlfn.XLOOKUP(' Flight data base'!D354,'airport codes'!$D$3:$D$2103,'airport codes'!$C$3:$C$2103)","v":"Belgium"},"ABJ",{"$f":"_xlfn.XLOOKUP(' Flight data base'!F354,'airport codes'!$D$3:$D$2103,'airport codes'!$C$3:$C$2103)","v":"Cote d'Ivoire"},"27DEC20",1450,2255,"2021-01-03",null,null,null,null,null,null,"X","PAXULD"]
[354,"Brussels Airlines","SN253","BRU",{"$f":"_xlfn.XLOOKUP(' Flight data base'!D355,'airport codes'!$D$3:$D$2103,'airport codes'!$C$3:$C$2103)","v":"Belgium"},"LFW",{"$f":"_xlfn.XLOOKUP(' Flight data base'!F355,'airport codes'!$D$3:$D$2103,'airport codes'!$C$3:$C$2103)","v":"Togo"},"30DEC20",1450,2040,"30DEC20",null,null,"X",null,null,null,null,"PAXULD"]
[355,"Brussels Airlines","SN253","BRU",{"$f":"_xlfn.XLOOKUP(' Flight data base'!D356,'airport codes'!$D$3:$D$2103,'airport codes'!$C$3:$C$2103)","v":"Belgium"},"ABJ",{"$f":"_xlfn.XLOOKUP(' Flight data base'!F356,'airport codes'!$D$3:$D$2103,'airport codes'!$C$3:$C$2103)","v":"Cote d'Ivoire"},"30DEC20",1450,2255,"30DEC20",null,null,"X",null,null,null,null,"PAXULD"]
[356,"Brussels Airlines","SN253","BRU",{"$f":"_xlfn.XLOOKUP(' Flight data base'!D357,'airport codes'!$D$3:$D$2103,'airport codes'!$C$3:$C$2103)","v":"Belgium"},"LFW",{"$f":"_xlfn.XLOOKUP(' Flight data base'!F357,'airport codes'!$D$3:$D$2103,'airport codes'!$C$3:$C$2103)","v":"Togo"},"2021-01-06",1450,2040,"2021-01-13",null,null,"X",null,null,null,"X","PAXULD"]
[357,"Brussels Airlines","SN253","BRU",{"$f":"_xlfn.XLOOKUP(' Flight data base'!D358,'airport codes'!$D$3:$D$2103,'airport codes'!$C$3:$C$2103)","v":"Belgium"},"ABJ",{"$f":"_xlfn.XLOOKUP(' Flight data base'!F358,'airport codes'!$D$3:$D$2103,'airport codes'!$C$3:$C$2103)","v":"Cote d'Ivoire"},"2021-01-06",1450,2255,"2021-01-13",null,null,"X",null,null,null,"X","PAXULD"]
[358,"Brussels Airlines","SN253","BRU",{"$f":"_xlfn.XLOOKUP(' Flight data base'!D359,'airport codes'!$D$3:$D$2103,'airport codes'!$C$3:$C$2103)","v":"Belgium"},"LFW",{"$f":"_xlfn.XLOOKUP(' Flight data base'!F359,'airport codes'!$D$3:$D$2103,'airport codes'!$C$3:$C$2103)","v":"Togo"},"16DEC20",1450,2040,"16DEC20",null,null,"X",null,null,null,null,"PAXULD"]
[359,"Brussels Airlines","SN253","BRU",{"$f":"_xlfn.XLOOKUP(' Flight data base'!D360,'airport codes'!$D$3:$D$2103,'airport codes'!$C$3:$C$2103)","v":"Belgium"},"ABJ",{"$f":"_xlfn.XLOOKUP(' Flight data base'!F360,'airport codes'!$D$3:$D$2103,'airport codes'!$C$3:$C$2103)","v":"Cote d'Ivoire"},"16DEC20",1450,2255,"16DEC20",null,null,"X",null,null,null,null,"PAXULD"]
[360,"Brussels Airlines","SN253","BRU",{"$f":"_xlfn.XLOOKUP(' Flight data base'!D361,'airport codes'!$D$3:$D$2103,'airport codes'!$C$3:$C$2103)","v":"Belgium"},"LFW",{"$f":"_xlfn.XLOOKUP(' Flight data base'!F361,'airport codes'!$D$3:$D$2103,'airport codes'!$C$3:$C$2103)","v":"Togo"},"20DEC20",1450,2040,"20DEC20",null,null,null,null,null,null,"X","PAXULD"]
[361,"Brussels Airlines","SN253","BRU",{"$f":"_xlfn.XLOOKUP(' Flight data base'!D362,'airport codes'!$D$3:$D$2103,'airport codes'!$C$3:$C$2103)","v":"Belgium"},"ABJ",{"$f":"_xlfn.XLOOKUP(' Flight data base'!F362,'airport codes'!$D$3:$D$2103,'airport codes'!$C$3:$C$2103)","v":"Cote d'Ivoire"},"20DEC20",1450,2255,"20DEC20",null,null,null,null,null,null,"X","PAXULD"]
[362,"Brussels Airlines","SN253","BRU",{"$f":"_xlfn.XLOOKUP(' Flight data base'!D363,'airport codes'!$D$3:$D$2103,'airport codes'!$C$3:$C$2103)","v":"Belgium"},"LFW",{"$f":"_xlfn.XLOOKUP(' Flight data base'!F363,'airport codes'!$D$3:$D$2103,'airport codes'!$C$3:$C$2103)","v":"Togo"},"23DEC20",1450,2040,"23DEC20",null,null,"X",null,null,null,null,"PAXULD"]
[363,"Brussels Airlines","SN253","BRU",{"$f":"_xlfn.XLOOKUP(' Flight data base'!D364,'airport codes'!$D$3:$D$2103,'airport codes'!$C$3:$C$2103)","v":"Belgium"},"ABJ",{"$f":"_xlfn.XLOOKUP(' Flight data base'!F364,'airport codes'!$D$3:$D$2103,'airport codes'!$C$3:$C$2103)","v":"Cote d'Ivoire"},"23DEC20",1450,2255,"23DEC20",null,null,"X",null,null,null,null,"PAXULD"]
[364,"Brussels Airlines","SN291","BRU",{"$f":"_xlfn.XLOOKUP(' Flight data base'!D365,'airport codes'!$D$3:$D$2103,'airport codes'!$C$3:$C$2103)","v":"Belgium"},"ACC",{"$f":"_xlfn.XLOOKUP(' Flight data base'!F365,'airport codes'!$D$3:$D$2103,'airport codes'!$C$3:$C$2103)","v":"Ghana"},"24DEC20",1450,2035,"26DEC20",null,null,null,"X",null,"X",null,"PAXULD"]
[365,"Brussels Airlines","SN291","BRU",{"$f":"_xlfn.XLOOKUP(' Flight data base'!D366,'airport codes'!$D$3:$D$2103,'airport codes'!$C$3:$C$2103)","v":"Belgium"},"ABJ",{"$f":"_xlfn.XLOOKUP(' Flight data base'!F366,'airport codes'!$D$3:$D$2103,'airport codes'!$C$3:$C$2103)","v":"Cote d'Ivoire"},"24DEC20",1450,2250,"26DEC20",null,null,null,"X",null,"X",null,"PAXULD"]
[366,"Brussels Airlines","SN291","BRU",{"$f":"_xlfn.XLOOKUP(' Flight data base'!D367,'airport codes'!$D$3:$D$2103,'airport codes'!$C$3:$C$2103)","v":"Belgium"},"ACC",{"$f":"_xlfn.XLOOKUP(' Flight data base'!F367,'airport codes'!$D$3:$D$2103,'airport codes'!$C$3:$C$2103)","v":"Ghana"},"31DEC20",1450,2035,"31DEC20",null,null,null,"X",null,null,null,"PAXULD"]
[367,"Brussels Airlines","SN291","BRU",{"$f":"_xlfn.XLOOKUP(' Flight data base'!D368,'airport codes'!$D$3:$D$2103,'airport codes'!$C$3:$C$2103)","v":"Belgium"},"ABJ",{"$f":"_xlfn.XLOOKUP(' Flight data base'!F368,'airport codes'!$D$3:$D$2103,'airport codes'!$C$3:$C$2103)","v":"Cote d'Ivoire"},"31DEC20",1450,2250,"31DEC20",null,null,null,"X",null,null,null,"PAXULD"]
[368,"Brussels Airlines","SN291","BRU",{"$f":"_xlfn.XLOOKUP(' Flight data base'!D369,'airport codes'!$D$3:$D$2103,'airport codes'!$C$3:$C$2103)","v":"Belgium"},"ACC",{"$f":"_xlfn.XLOOKUP(' Flight data base'!F369,'airport codes'!$D$3:$D$2103,'airport codes'!$C$3:$C$2103)","v":"Ghana"},"2021-01-02",1450,2035,"2021-01-02",null,null,null,null,null,"X",null,"PAXULD"]
[369,"Brussels Airlines","SN291","BRU",{"$f":"_xlfn.XLOOKUP(' Flight data base'!D370,'airport codes'!$D$3:$D$2103,'airport codes'!$C$3:$C$2103)","v":"Belgium"},"ABJ",{"$f":"_xlfn.XLOOKUP(' Flight data base'!F370,'airport codes'!$D$3:$D$2103,'airport codes'!$C$3:$C$2103)","v":"Cote d'Ivoire"},"2021-01-02",1450,2250,"2021-01-02",null,null,null,null,null,"X",null,"PAXULD"]
[370,"Brussels Airlines","SN291","BRU",{"$f":"_xlfn.XLOOKUP(' Flight data base'!D371,'airport codes'!$D$3:$D$2103,'airport codes'!$C$3:$C$2103)","v":"Belgium"},"ACC",{"$f":"_xlfn.XLOOKUP(' Flight data base'!F371,'airport codes'!$D$3:$D$2103,'airport codes'!$C$3:$C$2103)","v":"Ghana"},"2021-01-04",1450,2035,"2021-01-04","X",null,null,null,null,null,null,"PAXULD"]
[371,"Brussels Airlines","SN291","BRU",{"$f":"_xlfn.XLOOKUP(' Flight data base'!D372,'airport codes'!$D$3:$D$2103,'airport codes'!$C$3:$C$2103)","v":"Belgium"},"ABJ",{"$f":"_xlfn.XLOOKUP(' Flight data base'!F372,'airport codes'!$D$3:$D$2103,'airport codes'!$C$3:$C$2103)","v":"Cote d'Ivoire"},"2021-01-04",1450,2250,"2021-01-04","X",null,null,null,null,null,null,"PAXULD"]
[372,"Brussels Airlines","SN291","BRU",{"$f":"_xlfn.XLOOKUP(' Flight data base'!D373,'airport codes'!$D$3:$D$2103,'airport codes'!$C$3:$C$2103)","v":"Belgium"},"ACC",{"$f":"_xlfn.XLOOKUP(' Flight data base'!F373,'airport codes'!$D$3:$D$2103,'airport codes'!$C$3:$C$2103)","v":"Ghana"},"2021-01-07",1450,2035,"2021-01-14","X",null,null,"X",null,"X",null,"PAXULD"]
[373,"Brussels Airlines","SN291","BRU",{"$f":"_xlfn.XLOOKUP(' Flight data base'!D374,'airport codes'!$D$3:$D$2103,'airport codes'!$C$3:$C$2103)","v":"Belgium"},"ABJ",{"$f":"_xlfn.XLOOKUP(' Flight data base'!F374,'airport codes'!$D$3:$D$2103,'airport codes'!$C$3:$C$2103)","v":"Cote d'Ivoire"},"2021-01-07",1450,2250,"2021-01-14","X",null,null,"X",null,"X",null,"PAXULD"]
[374,"Brussels Airlines","SN291","BRU",{"$f":"_xlfn.XLOOKUP(' Flight data base'!D375,'airport codes'!$D$3:$D$2103,'airport codes'!$C$3:$C$2103)","v":"Belgium"},"ACC",{"$f":"_xlfn.XLOOKUP(' Flight data base'!F375,'airport codes'!$D$3:$D$2103,'airport codes'!$C$3:$C$2103)","v":"Ghana"},"17DEC20",1450,2035,"17DEC20",null,null,null,"X",null,null,null,"PAXULD"]
[375,"Brussels Airlines","SN291","BRU",{"$f":"_xlfn.XLOOKUP(' Flight data base'!D376,'airport codes'!$D$3:$D$2103,'airport codes'!$C$3:$C$2103)","v":"Belgium"},"ABJ",{"$f":"_xlfn.XLOOKUP(' Flight data base'!F376,'airport codes'!$D$3:$D$2103,'airport codes'!$C$3:$C$2103)","v":"Cote d'Ivoire"},"17DEC20",1450,2250,"17DEC20",null,null,null,"X",null,null,null,"PAXULD"]
[376,"Brussels Airlines","SN291","BRU",{"$f":"_xlfn.XLOOKUP(' Flight data base'!D377,'airport codes'!$D$3:$D$2103,'airport codes'!$C$3:$C$2103)","v":"Belgium"},"ACC",{"$f":"_xlfn.XLOOKUP(' Flight data base'!F377,'airport codes'!$D$3:$D$2103,'airport codes'!$C$3:$C$2103)","v":"Ghana"},"19DEC20",1450,2035,"19DEC20",null,null,null,null,null,"X",null,"PAXULD"]
[377,"Brussels Airlines","SN291","BRU",{"$f":"_xlfn.XLOOKUP(' Flight data base'!D378,'airport codes'!$D$3:$D$2103,'airport codes'!$C$3:$C$2103)","v":"Belgium"},"ABJ",{"$f":"_xlfn.XLOOKUP(' Flight data base'!F378,'airport codes'!$D$3:$D$2103,'airport codes'!$C$3:$C$2103)","v":"Cote d'Ivoire"},"19DEC20",1450,2250,"19DEC20",null,null,null,null,null,"X",null,"PAXULD"]
[378,"Brussels Airlines","SN291","BRU",{"$f":"_xlfn.XLOOKUP(' Flight data base'!D379,'airport codes'!$D$3:$D$2103,'airport codes'!$C$3:$C$2103)","v":"Belgium"},"ACC",{"$f":"_xlfn.XLOOKUP(' Flight data base'!F379,'airport codes'!$D$3:$D$2103,'airport codes'!$C$3:$C$2103)","v":"Ghana"},"21DEC20",1450,2035,"21DEC20","X",null,null,null,null,null,null,"PAXULD"]
[379,"Brussels Airlines","SN291","BRU",{"$f":"_xlfn.XLOOKUP(' Flight data base'!D380,'airport codes'!$D$3:$D$2103,'airport codes'!$C$3:$C$2103)","v":"Belgium"},"ABJ",{"$f":"_xlfn.XLOOKUP(' Flight data base'!F380,'airport codes'!$D$3:$D$2103,'airport codes'!$C$3:$C$2103)","v":"Cote d'Ivoire"},"21DEC20",1450,2250,"21DEC20","X",null,null,null,null,null,null,"PAXULD"]
[380,"Brussels Airlines","SN291","BRU",{"$f":"_xlfn.XLOOKUP(' Flight data base'!D381,'airport codes'!$D$3:$D$2103,'airport codes'!$C$3:$C$2103)","v":"Belgium"},"ACC",{"$f":"_xlfn.XLOOKUP(' Flight data base'!F381,'airport codes'!$D$3:$D$2103,'airport codes'!$C$3:$C$2103)","v":"Ghana"},"28DEC20",1450,2035,"28DEC20","X",null,null,null,null,null,null,"PAXULD"]
[381,"Brussels Airlines","SN291","BRU",{"$f":"_xlfn.XLOOKUP(' Flight data base'!D382,'airport codes'!$D$3:$D$2103,'airport codes'!$C$3:$C$2103)","v":"Belgium"},"ABJ",{"$f":"_xlfn.XLOOKUP(' Flight data base'!F382,'airport codes'!$D$3:$D$2103,'airport codes'!$C$3:$C$2103)","v":"Cote d'Ivoire"},"28DEC20",1450,2250,"28DEC20","X",null,null,null,null,null,null,"PAXULD"]
[382,"Brussels Airlines","SN357","BRU",{"$f":"_xlfn.XLOOKUP(' Flight data base'!D383,'airport codes'!$D$3:$D$2103,'airport codes'!$C$3:$C$2103)","v":"Belgium"},"FIH",{"$f":"_xlfn.XLOOKUP(' Flight data base'!F383,'airport codes'!$D$3:$D$2103,'airport codes'!$C$3:$C$2103)","v":"Congo (DRC)"},"2021-01-14",1510,2315,"2021-01-14",null,null,null,"X",null,null,null,"PAXULD"]
[383,"Brussels Airlines","SN357","BRU",{"$f":"_xlfn.XLOOKUP(' Flight data base'!D384,'airport codes'!$D$3:$D$2103,'airport codes'!$C$3:$C$2103)","v":"Belgium"},"FIH",{"$f":"_xlfn.XLOOKUP(' Flight data base'!F384,'airport codes'!$D$3:$D$2103,'airport codes'!$C$3:$C$2103)","v":"Congo (DRC)"},"22DEC20",1510,2315,"22DEC20",null,"X",null,null,null,null,null,"PAXULD"]
[384,"Brussels Airlines","SN357","BRU",{"$f":"_xlfn.XLOOKUP(' Flight data base'!D385,'airport codes'!$D$3:$D$2103,'airport codes'!$C$3:$C$2103)","v":"Belgium"},"FIH",{"$f":"_xlfn.XLOOKUP(' Flight data base'!F385,'airport codes'!$D$3:$D$2103,'airport codes'!$C$3:$C$2103)","v":"Congo (DRC)"},"26DEC20",1510,2315,"26DEC20",null,null,null,null,null,"X",null,"PAXULD"]
[385,"Brussels Airlines","SN357","BRU",{"$f":"_xlfn.XLOOKUP(' Flight data base'!D386,'airport codes'!$D$3:$D$2103,'airport codes'!$C$3:$C$2103)","v":"Belgium"},"FIH",{"$f":"_xlfn.XLOOKUP(' Flight data base'!F386,'airport codes'!$D$3:$D$2103,'airport codes'!$C$3:$C$2103)","v":"Congo (DRC)"},"28DEC20",1510,2315,"28DEC20","X",null,null,null,null,null,null,"PAXULD"]
[386,"Brussels Airlines","SN357","BRU",{"$f":"_xlfn.XLOOKUP(' Flight data base'!D387,'airport codes'!$D$3:$D$2103,'airport codes'!$C$3:$C$2103)","v":"Belgium"},"FIH",{"$f":"_xlfn.XLOOKUP(' Flight data base'!F387,'airport codes'!$D$3:$D$2103,'airport codes'!$C$3:$C$2103)","v":"Congo (DRC)"},"2021-01-01",1510,2315,"2021-01-08",null,null,null,null,"X",null,null,"PAXULD"]
[387,"Brussels Airlines","SN357","BRU",{"$f":"_xlfn.XLOOKUP(' Flight data base'!D388,'airport codes'!$D$3:$D$2103,'airport codes'!$C$3:$C$2103)","v":"Belgium"},"FIH",{"$f":"_xlfn.XLOOKUP(' Flight data base'!F388,'airport codes'!$D$3:$D$2103,'airport codes'!$C$3:$C$2103)","v":"Congo (DRC)"},"2021-01-02",1510,2315,"2021-01-04","X",null,null,null,null,"X",null,"PAXULD"]
[388,"Brussels Airlines","SN357","BRU",{"$f":"_xlfn.XLOOKUP(' Flight data base'!D389,'airport codes'!$D$3:$D$2103,'airport codes'!$C$3:$C$2103)","v":"Belgium"},"FIH",{"$f":"_xlfn.XLOOKUP(' Flight data base'!F389,'airport codes'!$D$3:$D$2103,'airport codes'!$C$3:$C$2103)","v":"Congo (DRC)"},"2021-01-03",1510,2315,"2021-01-05",null,"X",null,null,null,null,"X","PAXULD"]
[389,"Brussels Airlines","SN357","BRU",{"$f":"_xlfn.XLOOKUP(' Flight data base'!D390,'airport codes'!$D$3:$D$2103,'airport codes'!$C$3:$C$2103)","v":"Belgium"},"FIH",{"$f":"_xlfn.XLOOKUP(' Flight data base'!F390,'airport codes'!$D$3:$D$2103,'airport codes'!$C$3:$C$2103)","v":"Congo (DRC)"},"2021-01-06",1510,2315,"2021-01-06",null,null,"X",null,null,null,null,"PAXULD"]
[390,"Brussels Airlines","SN357","BRU",{"$f":"_xlfn.XLOOKUP(' Flight data base'!D391,'airport codes'!$D$3:$D$2103,'airport codes'!$C$3:$C$2103)","v":"Belgium"},"FIH",{"$f":"_xlfn.XLOOKUP(' Flight data base'!F391,'airport codes'!$D$3:$D$2103,'airport codes'!$C$3:$C$2103)","v":"Congo (DRC)"},"2021-01-07",1510,2315,"2021-01-07",null,null,null,"X",null,null,null,"PAXULD"]
[391,"Brussels Airlines","SN357","BRU",{"$f":"_xlfn.XLOOKUP(' Flight data base'!D392,'airport codes'!$D$3:$D$2103,'airport codes'!$C$3:$C$2103)","v":"Belgium"},"FIH",{"$f":"_xlfn.XLOOKUP(' Flight data base'!F392,'airport codes'!$D$3:$D$2103,'airport codes'!$C$3:$C$2103)","v":"Congo (DRC)"},"16DEC20",1510,2315,"16DEC20",null,null,"X",null,null,null,null,"PAXULD"]
[392,"Brussels Airlines","SN357","BRU",{"$f":"_xlfn.XLOOKUP(' Flight data base'!D393,'airport codes'!$D$3:$D$2103,'airport codes'!$C$3:$C$2103)","v":"Belgium"},"FIH",{"$f":"_xlfn.XLOOKUP(' Flight data base'!F393,'airport codes'!$D$3:$D$2103,'airport codes'!$C$3:$C$2103)","v":"Congo (DRC)"},"2021-01-09",1510,2315,"2021-01-11","X",null,null,null,null,"X",null,"PAXULD"]
[393,"Brussels Airlines","SN357","BRU",{"$f":"_xlfn.XLOOKUP(' Flight data base'!D394,'airport codes'!$D$3:$D$2103,'airport codes'!$C$3:$C$2103)","v":"Belgium"},"FIH",{"$f":"_xlfn.XLOOKUP(' Flight data base'!F394,'airport codes'!$D$3:$D$2103,'airport codes'!$C$3:$C$2103)","v":"Congo (DRC)"},"17DEC20",1510,2315,"17DEC20",null,null,null,"X",null,null,null,"PAXULD"]
[394,"Brussels Airlines","SN357","BRU",{"$f":"_xlfn.XLOOKUP(' Flight data base'!D395,'airport codes'!$D$3:$D$2103,'airport codes'!$C$3:$C$2103)","v":"Belgium"},"FIH",{"$f":"_xlfn.XLOOKUP(' Flight data base'!F395,'airport codes'!$D$3:$D$2103,'airport codes'!$C$3:$C$2103)","v":"Congo (DRC)"},"19DEC20",1510,2315,"19DEC20",null,null,null,null,null,"X",null,"PAXULD"]
[395,"Brussels Airlines","SN357","BRU",{"$f":"_xlfn.XLOOKUP(' Flight data base'!D396,'airport codes'!$D$3:$D$2103,'airport codes'!$C$3:$C$2103)","v":"Belgium"},"FIH",{"$f":"_xlfn.XLOOKUP(' Flight data base'!F396,'airport codes'!$D$3:$D$2103,'airport codes'!$C$3:$C$2103)","v":"Congo (DRC)"},"2021-01-12",1510,2315,"2021-01-12",null,"X",null,null,null,null,null,"PAXULD"]
[396,"Brussels Airlines","SN357","BRU",{"$f":"_xlfn.XLOOKUP(' Flight data base'!D397,'airport codes'!$D$3:$D$2103,'airport codes'!$C$3:$C$2103)","v":"Belgium"},"FIH",{"$f":"_xlfn.XLOOKUP(' Flight data base'!F397,'airport codes'!$D$3:$D$2103,'airport codes'!$C$3:$C$2103)","v":"Congo (DRC)"},"20DEC20",1510,2315,"20DEC20",null,null,null,null,null,null,"X","PAXULD"]
[397,"Brussels Airlines","SN357","BRU",{"$f":"_xlfn.XLOOKUP(' Flight data base'!D398,'airport codes'!$D$3:$D$2103,'airport codes'!$C$3:$C$2103)","v":"Belgium"},"FIH",{"$f":"_xlfn.XLOOKUP(' Flight data base'!F398,'airport codes'!$D$3:$D$2103,'airport codes'!$C$3:$C$2103)","v":"Congo (DRC)"},"2021-01-13",1510,2315,"2021-01-13",null,null,"X",null,null,null,null,"PAXULD"]
[398,"Brussels Airlines","SN357","BRU",{"$f":"_xlfn.XLOOKUP(' Flight data base'!D399,'airport codes'!$D$3:$D$2103,'airport codes'!$C$3:$C$2103)","v":"Belgium"},"FIH",{"$f":"_xlfn.XLOOKUP(' Flight data base'!F399,'airport codes'!$D$3:$D$2103,'airport codes'!$C$3:$C$2103)","v":"Congo (DRC)"},"21DEC20",1510,2315,"21DEC20","X",null,null,null,null,null,null,"PAXULD"]
[399,"Brussels Airlines","SN357","BRU",{"$f":"_xlfn.XLOOKUP(' Flight data base'!D400,'airport codes'!$D$3:$D$2103,'airport codes'!$C$3:$C$2103)","v":"Belgium"},"FIH",{"$f":"_xlfn.XLOOKUP(' Flight data base'!F400,'airport codes'!$D$3:$D$2103,'airport codes'!$C$3:$C$2103)","v":"Congo (DRC)"},"18DEC20",1510,2315,"18DEC20",null,null,null,null,"X",null,null,"PAXULD"]
[400,"Brussels Airlines","SN371","BRU",{"$f":"_xlfn.XLOOKUP(' Flight data base'!D401,'airport codes'!$D$3:$D$2103,'airport codes'!$C$3:$C$2103)","v":"Belgium"},"NSI",{"$f":"_xlfn.XLOOKUP(' Flight data base'!F401,'airport codes'!$D$3:$D$2103,'airport codes'!$C$3:$C$2103)","v":"Cameroon"},"15DEC20",1500,2335,"15DEC20",null,"X",null,null,null,null,null,"PAXULD"]
[401,"Brussels Airlines","SN371","BRU",{"$f":"_xlfn.XLOOKUP(' Flight data base'!D402,'airport codes'!$D$3:$D$2103,'airport codes'!$C$3:$C$2103)","v":"Belgium"},"DLA",{"$f":"_xlfn.XLOOKUP(' Flight data base'!F402,'airport codes'!$D$3:$D$2103,'airport codes'!$C$3:$C$2103)","v":"Cameroon"},"15DEC20",1500,2150,"15DEC20",null,"X",null,null,null,null,null,"PAXULD"]
[402,"Brussels Airlines","SN371","BRU",{"$f":"_xlfn.XLOOKUP(' Flight data base'!D403,'airport codes'!$D$3:$D$2103,'airport codes'!$C$3:$C$2103)","v":"Belgium"},"NSI",{"$f":"_xlfn.XLOOKUP(' Flight data base'!F403,'airport codes'!$D$3:$D$2103,'airport codes'!$C$3:$C$2103)","v":"Cameroon"},"17DEC20",1500,2335,"17DEC20",null,null,null,"X",null,null,null,"PAXULD"]
[403,"Brussels Airlines","SN371","BRU",{"$f":"_xlfn.XLOOKUP(' Flight data base'!D404,'airport codes'!$D$3:$D$2103,'airport codes'!$C$3:$C$2103)","v":"Belgium"},"DLA",{"$f":"_xlfn.XLOOKUP(' Flight data base'!F404,'airport codes'!$D$3:$D$2103,'airport codes'!$C$3:$C$2103)","v":"Cameroon"},"17DEC20",1500,2150,"17DEC20",null,null,null,"X",null,null,null,"PAXULD"]
[404,"Brussels Airlines","SN371","BRU",{"$f":"_xlfn.XLOOKUP(' Flight data base'!D405,'airport codes'!$D$3:$D$2103,'airport codes'!$C$3:$C$2103)","v":"Belgium"},"NSI",{"$f":"_xlfn.XLOOKUP(' Flight data base'!F405,'airport codes'!$D$3:$D$2103,'airport codes'!$C$3:$C$2103)","v":"Cameroon"},"24DEC20",1500,2335,"11FEB21",null,null,null,"X",null,null,null,"PAXULD"]
[405,"Brussels Airlines","SN371","BRU",{"$f":"_xlfn.XLOOKUP(' Flight data base'!D406,'airport codes'!$D$3:$D$2103,'airport codes'!$C$3:$C$2103)","v":"Belgium"},"DLA",{"$f":"_xlfn.XLOOKUP(' Flight data base'!F406,'airport codes'!$D$3:$D$2103,'airport codes'!$C$3:$C$2103)","v":"Cameroon"},"24DEC20",1500,2150,"11FEB21",null,null,null,"X",null,null,null,"PAXULD"]
[406,"Brussels Airlines","SN371","BRU",{"$f":"_xlfn.XLOOKUP(' Flight data base'!D407,'airport codes'!$D$3:$D$2103,'airport codes'!$C$3:$C$2103)","v":"Belgium"},"NSI",{"$f":"_xlfn.XLOOKUP(' Flight data base'!F407,'airport codes'!$D$3:$D$2103,'airport codes'!$C$3:$C$2103)","v":"Cameroon"},"19DEC20",1500,2335,"19DEC20",null,null,null,null,null,"X",null,"PAXULD"]
[407,"Brussels Airlines","SN371","BRU",{"$f":"_xlfn.XLOOKUP(' Flight data base'!D408,'airport codes'!$D$3:$D$2103,'airport codes'!$C$3:$C$2103)","v":"Belgium"},"DLA",{"$f":"_xlfn.XLOOKUP(' Flight data base'!F408,'airport codes'!$D$3:$D$2103,'airport codes'!$C$3:$C$2103)","v":"Cameroon"},"19DEC20",1500,2150,"19DEC20",null,null,null,null,null,"X",null,"PAXULD"]
[408,"Brussels Airlines","SN371","BRU",{"$f":"_xlfn.XLOOKUP(' Flight data base'!D409,'airport codes'!$D$3:$D$2103,'airport codes'!$C$3:$C$2103)","v":"Belgium"},"NSI",{"$f":"_xlfn.XLOOKUP(' Flight data base'!F409,'airport codes'!$D$3:$D$2103,'airport codes'!$C$3:$C$2103)","v":"Cameroon"},"22DEC20",1500,2335,"13FEB21",null,"X",null,null,null,"X",null,"PAXULD"]
[409,"Brussels Airlines","SN371","BRU",{"$f":"_xlfn.XLOOKUP(' Flight data base'!D410,'airport codes'!$D$3:$D$2103,'airport codes'!$C$3:$C$2103)","v":"Belgium"},"DLA",{"$f":"_xlfn.XLOOKUP(' Flight data base'!F410,'airport codes'!$D$3:$D$2103,'airport codes'!$C$3:$C$2103)","v":"Cameroon"},"22DEC20",1500,2150,"13FEB21",null,"X",null,null,null,"X",null,"PAXULD"]
[410,"Brussels Airlines","SN385","BRU",{"$f":"_xlfn.XLOOKUP(' Flight data base'!D411,'airport codes'!$D$3:$D$2103,'airport codes'!$C$3:$C$2103)","v":"Belgium"},"DLA",{"$f":"_xlfn.XLOOKUP(' Flight data base'!F411,'airport codes'!$D$3:$D$2103,'airport codes'!$C$3:$C$2103)","v":"Cameroon"},"21DEC20",1500,2350,"21DEC20","X",null,null,null,null,null,null,"PAXULD"]
[411,"Brussels Airlines","SN385","BRU",{"$f":"_xlfn.XLOOKUP(' Flight data base'!D412,'airport codes'!$D$3:$D$2103,'airport codes'!$C$3:$C$2103)","v":"Belgium"},"NSI",{"$f":"_xlfn.XLOOKUP(' Flight data base'!F412,'airport codes'!$D$3:$D$2103,'airport codes'!$C$3:$C$2103)","v":"Cameroon"},"21DEC20",1500,2205,"21DEC20","X",null,null,null,null,null,null,"PAXULD"]
[412,"Brussels Airlines","SN385","BRU",{"$f":"_xlfn.XLOOKUP(' Flight data base'!D413,'airport codes'!$D$3:$D$2103,'airport codes'!$C$3:$C$2103)","v":"Belgium"},"DLA",{"$f":"_xlfn.XLOOKUP(' Flight data base'!F413,'airport codes'!$D$3:$D$2103,'airport codes'!$C$3:$C$2103)","v":"Cameroon"},"28DEC20",1500,2350,"2021-01-11","X",null,null,null,null,null,null,"PAXULD"]
[413,"Brussels Airlines","SN385","BRU",{"$f":"_xlfn.XLOOKUP(' Flight data base'!D414,'airport codes'!$D$3:$D$2103,'airport codes'!$C$3:$C$2103)","v":"Belgium"},"NSI",{"$f":"_xlfn.XLOOKUP(' Flight data base'!F414,'airport codes'!$D$3:$D$2103,'airport codes'!$C$3:$C$2103)","v":"Cameroon"},"28DEC20",1500,2205,"2021-01-11","X",null,null,null,null,null,null,"PAXULD"]
[414,"Brussels Airlines","SN459","BRU",{"$f":"_xlfn.XLOOKUP(' Flight data base'!D415,'airport codes'!$D$3:$D$2103,'airport codes'!$C$3:$C$2103)","v":"Belgium"},"BJM",{"$f":"_xlfn.XLOOKUP(' Flight data base'!F415,'airport codes'!$D$3:$D$2103,'airport codes'!$C$3:$C$2103)","v":"Burundi"},"15DEC20",1450,210,"15DEC20",null,"X",null,null,null,null,null,"PAXULD"]
[415,"Brussels Airlines","SN459","BRU",{"$f":"_xlfn.XLOOKUP(' Flight data base'!D416,'airport codes'!$D$3:$D$2103,'airport codes'!$C$3:$C$2103)","v":"Belgium"},"EBB",{"$f":"_xlfn.XLOOKUP(' Flight data base'!F416,'airport codes'!$D$3:$D$2103,'airport codes'!$C$3:$C$2103)","v":"Uganda"},"15DEC20",1450,100,"15DEC20",null,"X",null,null,null,null,null,"PAXULD"]
[416,"Brussels Airlines","SN459","BRU",{"$f":"_xlfn.XLOOKUP(' Flight data base'!D417,'airport codes'!$D$3:$D$2103,'airport codes'!$C$3:$C$2103)","v":"Belgium"},"BJM",{"$f":"_xlfn.XLOOKUP(' Flight data base'!F417,'airport codes'!$D$3:$D$2103,'airport codes'!$C$3:$C$2103)","v":"Burundi"},"22DEC20",1450,210,"29DEC20",null,"X",null,null,null,null,null,"PAXULD"]
[417,"Brussels Airlines","SN459","BRU",{"$f":"_xlfn.XLOOKUP(' Flight data base'!D418,'airport codes'!$D$3:$D$2103,'airport codes'!$C$3:$C$2103)","v":"Belgium"},"EBB",{"$f":"_xlfn.XLOOKUP(' Flight data base'!F418,'airport codes'!$D$3:$D$2103,'airport codes'!$C$3:$C$2103)","v":"Uganda"},"22DEC20",1450,100,"29DEC20",null,"X",null,null,null,null,null,"PAXULD"]
[418,"Brussels Airlines","SN459","BRU",{"$f":"_xlfn.XLOOKUP(' Flight data base'!D419,'airport codes'!$D$3:$D$2103,'airport codes'!$C$3:$C$2103)","v":"Belgium"},"BJM",{"$f":"_xlfn.XLOOKUP(' Flight data base'!F419,'airport codes'!$D$3:$D$2103,'airport codes'!$C$3:$C$2103)","v":"Burundi"},"2021-01-11",1450,205,"2021-03-22","X",null,null,null,null,null,null,"PAXULD"]
[419,"Brussels Airlines","SN459","BRU",{"$f":"_xlfn.XLOOKUP(' Flight data base'!D420,'airport codes'!$D$3:$D$2103,'airport codes'!$C$3:$C$2103)","v":"Belgium"},"EBB",{"$f":"_xlfn.XLOOKUP(' Flight data base'!F420,'airport codes'!$D$3:$D$2103,'airport codes'!$C$3:$C$2103)","v":"Uganda"},"2021-01-11",1450,100,"2021-03-22","X",null,null,null,null,null,null,"PAXULD"]
[420,"Brussels Airlines","SN473","BRU",{"$f":"_xlfn.XLOOKUP(' Flight data base'!D421,'airport codes'!$D$3:$D$2103,'airport codes'!$C$3:$C$2103)","v":"Belgium"},"KGL",{"$f":"_xlfn.XLOOKUP(' Flight data base'!F421,'airport codes'!$D$3:$D$2103,'airport codes'!$C$3:$C$2103)","v":"Rwanda"},"22DEC20",1450,155,"22DEC20",null,"X",null,null,null,null,null,"PAXULD"]
[421,"Brussels Airlines","SN473","BRU",{"$f":"_xlfn.XLOOKUP(' Flight data base'!D422,'airport codes'!$D$3:$D$2103,'airport codes'!$C$3:$C$2103)","v":"Belgium"},"EBB",{"$f":"_xlfn.XLOOKUP(' Flight data base'!F422,'airport codes'!$D$3:$D$2103,'airport codes'!$C$3:$C$2103)","v":"Uganda"},"22DEC20",1450,100,"22DEC20",null,"X",null,null,null,null,null,"PAXULD"]
[422,"Brussels Airlines","SN473","BRU",{"$f":"_xlfn.XLOOKUP(' Flight data base'!D423,'airport codes'!$D$3:$D$2103,'airport codes'!$C$3:$C$2103)","v":"Belgium"},"KGL",{"$f":"_xlfn.XLOOKUP(' Flight data base'!F423,'airport codes'!$D$3:$D$2103,'airport codes'!$C$3:$C$2103)","v":"Rwanda"},"2021-01-05",1450,155,"2021-01-05",null,"X",null,null,null,null,null,"PAXULD"]
[423,"Brussels Airlines","SN473","BRU",{"$f":"_xlfn.XLOOKUP(' Flight data base'!D424,'airport codes'!$D$3:$D$2103,'airport codes'!$C$3:$C$2103)","v":"Belgium"},"EBB",{"$f":"_xlfn.XLOOKUP(' Flight data base'!F424,'airport codes'!$D$3:$D$2103,'airport codes'!$C$3:$C$2103)","v":"Uganda"},"2021-01-05",1450,100,"2021-01-05",null,"X",null,null,null,null,null,"PAXULD"]
[424,"Brussels Airlines","SN473","BRU",{"$f":"_xlfn.XLOOKUP(' Flight data base'!D425,'airport codes'!$D$3:$D$2103,'airport codes'!$C$3:$C$2103)","v":"Belgium"},"KGL",{"$f":"_xlfn.XLOOKUP(' Flight data base'!F425,'airport codes'!$D$3:$D$2103,'airport codes'!$C$3:$C$2103)","v":"Rwanda"},"2021-01-02",1450,150,"2021-01-09",null,null,null,null,null,"X",null,"PAXULD"]
[425,"Brussels Airlines","SN473","BRU",{"$f":"_xlfn.XLOOKUP(' Flight data base'!D426,'airport codes'!$D$3:$D$2103,'airport codes'!$C$3:$C$2103)","v":"Belgium"},"EBB",{"$f":"_xlfn.XLOOKUP(' Flight data base'!F426,'airport codes'!$D$3:$D$2103,'airport codes'!$C$3:$C$2103)","v":"Uganda"},"2021-01-02",1450,100,"2021-01-09",null,null,null,null,null,"X",null,"PAXULD"]
[426,"Brussels Airlines","SN473","BRU",{"$f":"_xlfn.XLOOKUP(' Flight data base'!D427,'airport codes'!$D$3:$D$2103,'airport codes'!$C$3:$C$2103)","v":"Belgium"},"KGL",{"$f":"_xlfn.XLOOKUP(' Flight data base'!F427,'airport codes'!$D$3:$D$2103,'airport codes'!$C$3:$C$2103)","v":"Rwanda"},"2021-01-07",1450,150,"2021-01-14",null,null,null,"X",null,null,null,"PAXULD"]
[427,"Brussels Airlines","SN473","BRU",{"$f":"_xlfn.XLOOKUP(' Flight data base'!D428,'airport codes'!$D$3:$D$2103,'airport codes'!$C$3:$C$2103)","v":"Belgium"},"EBB",{"$f":"_xlfn.XLOOKUP(' Flight data base'!F428,'airport codes'!$D$3:$D$2103,'airport codes'!$C$3:$C$2103)","v":"Uganda"},"2021-01-07",1450,100,"2021-01-14",null,null,null,"X",null,null,null,"PAXULD"]
[428,"Brussels Airlines","SN473","BRU",{"$f":"_xlfn.XLOOKUP(' Flight data base'!D429,'airport codes'!$D$3:$D$2103,'airport codes'!$C$3:$C$2103)","v":"Belgium"},"KGL",{"$f":"_xlfn.XLOOKUP(' Flight data base'!F429,'airport codes'!$D$3:$D$2103,'airport codes'!$C$3:$C$2103)","v":"Rwanda"},"17DEC20",1450,150,"17DEC20",null,null,null,"X",null,null,null,"PAXULD"]
[429,"Brussels Airlines","SN473","BRU",{"$f":"_xlfn.XLOOKUP(' Flight data base'!D430,'airport codes'!$D$3:$D$2103,'airport codes'!$C$3:$C$2103)","v":"Belgium"},"EBB",{"$f":"_xlfn.XLOOKUP(' Flight data base'!F430,'airport codes'!$D$3:$D$2103,'airport codes'!$C$3:$C$2103)","v":"Uganda"},"17DEC20",1450,100,"17DEC20",null,null,null,"X",null,null,null,"PAXULD"]
[430,"Brussels Airlines","SN473","BRU",{"$f":"_xlfn.XLOOKUP(' Flight data base'!D431,'airport codes'!$D$3:$D$2103,'airport codes'!$C$3:$C$2103)","v":"Belgium"},"KGL",{"$f":"_xlfn.XLOOKUP(' Flight data base'!F431,'airport codes'!$D$3:$D$2103,'airport codes'!$C$3:$C$2103)","v":"Rwanda"},"24DEC20",1450,150,"24DEC20",null,null,null,"X",null,null,null,"PAXULD"]
[431,"Brussels Airlines","SN473","BRU",{"$f":"_xlfn.XLOOKUP(' Flight data base'!D432,'airport codes'!$D$3:$D$2103,'airport codes'!$C$3:$C$2103)","v":"Belgium"},"EBB",{"$f":"_xlfn.XLOOKUP(' Flight data base'!F432,'airport codes'!$D$3:$D$2103,'airport codes'!$C$3:$C$2103)","v":"Uganda"},"24DEC20",1450,100,"24DEC20",null,null,null,"X",null,null,null,"PAXULD"]
[432,"Brussels Airlines","SN473","BRU",{"$f":"_xlfn.XLOOKUP(' Flight data base'!D433,'airport codes'!$D$3:$D$2103,'airport codes'!$C$3:$C$2103)","v":"Belgium"},"KGL",{"$f":"_xlfn.XLOOKUP(' Flight data base'!F433,'airport codes'!$D$3:$D$2103,'airport codes'!$C$3:$C$2103)","v":"Rwanda"},"19DEC20",1450,150,"19DEC20",null,null,null,null,null,"X",null,"PAXULD"]
[433,"Brussels Airlines","SN473","BRU",{"$f":"_xlfn.XLOOKUP(' Flight data base'!D434,'airport codes'!$D$3:$D$2103,'airport codes'!$C$3:$C$2103)","v":"Belgium"},"EBB",{"$f":"_xlfn.XLOOKUP(' Flight data base'!F434,'airport codes'!$D$3:$D$2103,'airport codes'!$C$3:$C$2103)","v":"Uganda"},"19DEC20",1450,100,"19DEC20",null,null,null,null,null,"X",null,"PAXULD"]
[434,"Brussels Airlines","SN473","BRU",{"$f":"_xlfn.XLOOKUP(' Flight data base'!D435,'airport codes'!$D$3:$D$2103,'airport codes'!$C$3:$C$2103)","v":"Belgium"},"KGL",{"$f":"_xlfn.XLOOKUP(' Flight data base'!F435,'airport codes'!$D$3:$D$2103,'airport codes'!$C$3:$C$2103)","v":"Rwanda"},"26DEC20",1450,150,"26DEC20",null,null,null,null,null,"X",null,"PAXULD"]
[435,"Brussels Airlines","SN473","BRU",{"$f":"_xlfn.XLOOKUP(' Flight data base'!D436,'airport codes'!$D$3:$D$2103,'airport codes'!$C$3:$C$2103)","v":"Belgium"},"EBB",{"$f":"_xlfn.XLOOKUP(' Flight data base'!F436,'airport codes'!$D$3:$D$2103,'airport codes'!$C$3:$C$2103)","v":"Uganda"},"26DEC20",1450,100,"26DEC20",null,null,null,null,null,"X",null,"PAXULD"]
[436,"Lufthansa","LH1327","TUN",{"$f":"_xlfn.XLOOKUP(' Flight data base'!D437,'airport codes'!$D$3:$D$2103,'airport codes'!$C$3:$C$2103)","v":"Tunisia"},"FRA",{"$f":"_xlfn.XLOOKUP(' Flight data base'!F437,'airport codes'!$D$3:$D$2103,'airport codes'!$C$3:$C$2103)","v":"Germany"},"17DEC20",255,535,"17DEC20",null,null,null,"X",null,null,null,"PAXULD"]
[437,"Lufthansa","LH1327","TUN",{"$f":"_xlfn.XLOOKUP(' Flight data base'!D438,'airport codes'!$D$3:$D$2103,'airport codes'!$C$3:$C$2103)","v":"Tunisia"},"FRA",{"$f":"_xlfn.XLOOKUP(' Flight data base'!F438,'airport codes'!$D$3:$D$2103,'airport codes'!$C$3:$C$2103)","v":"Germany"},"20DEC20",255,535,"27DEC20",null,null,null,null,null,null,"X","PAXULD"]
[438,"Lufthansa","LH1327","TUN",{"$f":"_xlfn.XLOOKUP(' Flight data base'!D439,'airport codes'!$D$3:$D$2103,'airport codes'!$C$3:$C$2103)","v":"Tunisia"},"FRA",{"$f":"_xlfn.XLOOKUP(' Flight data base'!F439,'airport codes'!$D$3:$D$2103,'airport codes'!$C$3:$C$2103)","v":"Germany"},"24DEC20",255,535,"24DEC20",null,null,null,"X",null,null,null,"PAXULD"]
[439,"Lufthansa","LH1327","TUN",{"$f":"_xlfn.XLOOKUP(' Flight data base'!D440,'airport codes'!$D$3:$D$2103,'airport codes'!$C$3:$C$2103)","v":"Tunisia"},"FRA",{"$f":"_xlfn.XLOOKUP(' Flight data base'!F440,'airport codes'!$D$3:$D$2103,'airport codes'!$C$3:$C$2103)","v":"Germany"},"2021-01-14",255,535,"2021-01-28",null,null,null,"X",null,null,null,"PAXULD"]
[440,"Lufthansa","LH1327","TUN",{"$f":"_xlfn.XLOOKUP(' Flight data base'!D441,'airport codes'!$D$3:$D$2103,'airport codes'!$C$3:$C$2103)","v":"Tunisia"},"FRA",{"$f":"_xlfn.XLOOKUP(' Flight data base'!F441,'airport codes'!$D$3:$D$2103,'airport codes'!$C$3:$C$2103)","v":"Germany"},"31DEC20",255,535,"31DEC20",null,null,null,"X",null,null,null,"Others"]
[441,"Lufthansa","LH1327","TUN",{"$f":"_xlfn.XLOOKUP(' Flight data base'!D442,'airport codes'!$D$3:$D$2103,'airport codes'!$C$3:$C$2103)","v":"Tunisia"},"FRA",{"$f":"_xlfn.XLOOKUP(' Flight data base'!F442,'airport codes'!$D$3:$D$2103,'airport codes'!$C$3:$C$2103)","v":"Germany"},"2021-01-03",255,535,"2021-01-10",null,null,null,null,null,null,"X","PAXULD"]
[442,"Lufthansa","LH1327","TUN",{"$f":"_xlfn.XLOOKUP(' Flight data base'!D443,'airport codes'!$D$3:$D$2103,'airport codes'!$C$3:$C$2103)","v":"Tunisia"},"FRA",{"$f":"_xlfn.XLOOKUP(' Flight data base'!F443,'airport codes'!$D$3:$D$2103,'airport codes'!$C$3:$C$2103)","v":"Germany"},"2021-01-07",255,535,"2021-01-07",null,null,null,"X",null,null,null,"PAXULD"]
[443,"Lufthansa","LH561","LAD",{"$f":"_xlfn.XLOOKUP(' Flight data base'!D444,'airport codes'!$D$3:$D$2103,'airport codes'!$C$3:$C$2103)","v":"Angola"},"FRA",{"$f":"_xlfn.XLOOKUP(' Flight data base'!F444,'airport codes'!$D$3:$D$2103,'airport codes'!$C$3:$C$2103)","v":"Germany"},"21DEC20",2255,725,"21DEC20","X",null,null,null,null,null,null,"PAXULD"]
[444,"Lufthansa","LH561","LAD",{"$f":"_xlfn.XLOOKUP(' Flight data base'!D445,'airport codes'!$D$3:$D$2103,'airport codes'!$C$3:$C$2103)","v":"Angola"},"FRA",{"$f":"_xlfn.XLOOKUP(' Flight data base'!F445,'airport codes'!$D$3:$D$2103,'airport codes'!$C$3:$C$2103)","v":"Germany"},"28DEC20",2255,725,"28DEC20","X",null,null,null,null,null,null,"PAXULD"]
[445,"Lufthansa","LH561","LAD",{"$f":"_xlfn.XLOOKUP(' Flight data base'!D446,'airport codes'!$D$3:$D$2103,'airport codes'!$C$3:$C$2103)","v":"Angola"},"FRA",{"$f":"_xlfn.XLOOKUP(' Flight data base'!F446,'airport codes'!$D$3:$D$2103,'airport codes'!$C$3:$C$2103)","v":"Germany"},"16DEC20",2255,725,"2021-03-24",null,null,"X",null,null,null,null,"PAXULD"]
[446,"Lufthansa","LH561","LAD",{"$f":"_xlfn.XLOOKUP(' Flight data base'!D447,'airport codes'!$D$3:$D$2103,'airport codes'!$C$3:$C$2103)","v":"Angola"},"FRA",{"$f":"_xlfn.XLOOKUP(' Flight data base'!F447,'airport codes'!$D$3:$D$2103,'airport codes'!$C$3:$C$2103)","v":"Germany"},"2021-01-04",2255,725,"2021-01-04","X",null,null,null,null,null,null,"PAXULD"]
[447,"Lufthansa","LH561","LAD",{"$f":"_xlfn.XLOOKUP(' Flight data base'!D448,'airport codes'!$D$3:$D$2103,'airport codes'!$C$3:$C$2103)","v":"Angola"},"FRA",{"$f":"_xlfn.XLOOKUP(' Flight data base'!F448,'airport codes'!$D$3:$D$2103,'airport codes'!$C$3:$C$2103)","v":"Germany"},"2021-01-11",2255,725,"2021-03-22","X",null,null,null,null,null,null,"PAXULD"]
[448,"Lufthansa","LH568","LOS",{"$f":"_xlfn.XLOOKUP(' Flight data base'!D449,'airport codes'!$D$3:$D$2103,'airport codes'!$C$3:$C$2103)","v":"Nigeria"},"SSG",{"$f":"_xlfn.XLOOKUP(' Flight data base'!F449,'airport codes'!$D$3:$D$2103,'airport codes'!$C$3:$C$2103)","v":"Equatorial Guinea"},"26DEC20",1825,1950,"26DEC20",null,null,null,null,null,"X",null,"PAXULD"]
[449,"Lufthansa","LH568","LOS",{"$f":"_xlfn.XLOOKUP(' Flight data base'!D450,'airport codes'!$D$3:$D$2103,'airport codes'!$C$3:$C$2103)","v":"Nigeria"},"SSG",{"$f":"_xlfn.XLOOKUP(' Flight data base'!F450,'airport codes'!$D$3:$D$2103,'airport codes'!$C$3:$C$2103)","v":"Equatorial Guinea"},"28DEC20",1825,1950,"30DEC20","X",null,"X",null,null,null,null,"PAXULD"]
[450,"Lufthansa","LH568","LOS",{"$f":"_xlfn.XLOOKUP(' Flight data base'!D451,'airport codes'!$D$3:$D$2103,'airport codes'!$C$3:$C$2103)","v":"Nigeria"},"SSG",{"$f":"_xlfn.XLOOKUP(' Flight data base'!F451,'airport codes'!$D$3:$D$2103,'airport codes'!$C$3:$C$2103)","v":"Equatorial Guinea"},"2021-01-02",1825,1950,"2021-01-02",null,null,null,null,null,"X",null,"PAXULD"]
[451,"Lufthansa","LH568","LOS",{"$f":"_xlfn.XLOOKUP(' Flight data base'!D452,'airport codes'!$D$3:$D$2103,'airport codes'!$C$3:$C$2103)","v":"Nigeria"},"SSG",{"$f":"_xlfn.XLOOKUP(' Flight data base'!F452,'airport codes'!$D$3:$D$2103,'airport codes'!$C$3:$C$2103)","v":"Equatorial Guinea"},"2021-01-04",1825,1950,"2021-01-06","X",null,"X",null,null,null,null,"PAXULD"]
[452,"Lufthansa","LH568","LOS",{"$f":"_xlfn.XLOOKUP(' Flight data base'!D453,'airport codes'!$D$3:$D$2103,'airport codes'!$C$3:$C$2103)","v":"Nigeria"},"SSG",{"$f":"_xlfn.XLOOKUP(' Flight data base'!F453,'airport codes'!$D$3:$D$2103,'airport codes'!$C$3:$C$2103)","v":"Equatorial Guinea"},"2021-01-07",1825,1950,"2021-01-15","X",null,"X","X","X",null,null,"PAXULD"]
[453,"Lufthansa","LH568","LOS",{"$f":"_xlfn.XLOOKUP(' Flight data base'!D454,'airport codes'!$D$3:$D$2103,'airport codes'!$C$3:$C$2103)","v":"Nigeria"},"SSG",{"$f":"_xlfn.XLOOKUP(' Flight data base'!F454,'airport codes'!$D$3:$D$2103,'airport codes'!$C$3:$C$2103)","v":"Equatorial Guinea"},"2021-01-09",1825,1950,"2021-01-09",null,null,null,null,null,"X",null,"PAXULD"]
[454,"Lufthansa","LH568","LOS",{"$f":"_xlfn.XLOOKUP(' Flight data base'!D455,'airport codes'!$D$3:$D$2103,'airport codes'!$C$3:$C$2103)","v":"Nigeria"},"SSG",{"$f":"_xlfn.XLOOKUP(' Flight data base'!F455,'airport codes'!$D$3:$D$2103,'airport codes'!$C$3:$C$2103)","v":"Equatorial Guinea"},"16DEC20",1825,1950,"16DEC20",null,null,"X",null,null,null,null,"PAXULD"]
[455,"Lufthansa","LH568","LOS",{"$f":"_xlfn.XLOOKUP(' Flight data base'!D456,'airport codes'!$D$3:$D$2103,'airport codes'!$C$3:$C$2103)","v":"Nigeria"},"SSG",{"$f":"_xlfn.XLOOKUP(' Flight data base'!F456,'airport codes'!$D$3:$D$2103,'airport codes'!$C$3:$C$2103)","v":"Equatorial Guinea"},"2021-01-10",1825,1950,"2021-01-10",null,null,null,null,null,null,"X","PAXULD"]
[456,"Lufthansa","LH568","LOS",{"$f":"_xlfn.XLOOKUP(' Flight data base'!D457,'airport codes'!$D$3:$D$2103,'airport codes'!$C$3:$C$2103)","v":"Nigeria"},"SSG",{"$f":"_xlfn.XLOOKUP(' Flight data base'!F457,'airport codes'!$D$3:$D$2103,'airport codes'!$C$3:$C$2103)","v":"Equatorial Guinea"},"17DEC20",1825,1950,"17DEC20",null,null,null,"X",null,null,null,"PAXULD"]
[457,"Lufthansa","LH568","LOS",{"$f":"_xlfn.XLOOKUP(' Flight data base'!D458,'airport codes'!$D$3:$D$2103,'airport codes'!$C$3:$C$2103)","v":"Nigeria"},"SSG",{"$f":"_xlfn.XLOOKUP(' Flight data base'!F458,'airport codes'!$D$3:$D$2103,'airport codes'!$C$3:$C$2103)","v":"Equatorial Guinea"},"18DEC20",1825,1950,"18DEC20",null,null,null,null,"X",null,null,"PAXULD"]
[458,"Lufthansa","LH568","LOS",{"$f":"_xlfn.XLOOKUP(' Flight data base'!D459,'airport codes'!$D$3:$D$2103,'airport codes'!$C$3:$C$2103)","v":"Nigeria"},"SSG",{"$f":"_xlfn.XLOOKUP(' Flight data base'!F459,'airport codes'!$D$3:$D$2103,'airport codes'!$C$3:$C$2103)","v":"Equatorial Guinea"},"19DEC20",1825,1950,"23DEC20","X",null,"X",null,null,"X",null,"PAXULD"]
[459,"Lufthansa","LH569","SSG",{"$f":"_xlfn.XLOOKUP(' Flight data base'!D460,'airport codes'!$D$3:$D$2103,'airport codes'!$C$3:$C$2103)","v":"Equatorial Guinea"},"FRA",{"$f":"_xlfn.XLOOKUP(' Flight data base'!F460,'airport codes'!$D$3:$D$2103,'airport codes'!$C$3:$C$2103)","v":"Germany"},"23DEC20",2110,620,"23DEC20",null,null,"X",null,null,null,null,"PAXULD"]
[460,"Lufthansa","LH569","SSG",{"$f":"_xlfn.XLOOKUP(' Flight data base'!D461,'airport codes'!$D$3:$D$2103,'airport codes'!$C$3:$C$2103)","v":"Equatorial Guinea"},"LOS",{"$f":"_xlfn.XLOOKUP(' Flight data base'!F461,'airport codes'!$D$3:$D$2103,'airport codes'!$C$3:$C$2103)","v":"Nigeria"},"23DEC20",2110,2240,"23DEC20",null,null,"X",null,null,null,null,"PAXULD"]
[461,"Lufthansa","LH569","LOS",{"$f":"_xlfn.XLOOKUP(' Flight data base'!D462,'airport codes'!$D$3:$D$2103,'airport codes'!$C$3:$C$2103)","v":"Nigeria"},"FRA",{"$f":"_xlfn.XLOOKUP(' Flight data base'!F462,'airport codes'!$D$3:$D$2103,'airport codes'!$C$3:$C$2103)","v":"Germany"},"23DEC20",2350,620,"23DEC20",null,null,"X",null,null,null,null,"PAXULD"]
[462,"Lufthansa","LH569","SSG",{"$f":"_xlfn.XLOOKUP(' Flight data base'!D463,'airport codes'!$D$3:$D$2103,'airport codes'!$C$3:$C$2103)","v":"Equatorial Guinea"},"FRA",{"$f":"_xlfn.XLOOKUP(' Flight data base'!F463,'airport codes'!$D$3:$D$2103,'airport codes'!$C$3:$C$2103)","v":"Germany"},"26DEC20",2110,620,"28DEC20","X",null,null,null,null,"X",null,"PAXULD"]
[463,"Lufthansa","LH569","SSG",{"$f":"_xlfn.XLOOKUP(' Flight data base'!D464,'airport codes'!$D$3:$D$2103,'airport codes'!$C$3:$C$2103)","v":"Equatorial Guinea"},"LOS",{"$f":"_xlfn.XLOOKUP(' Flight data base'!F464,'airport codes'!$D$3:$D$2103,'airport codes'!$C$3:$C$2103)","v":"Nigeria"},"26DEC20",2110,2240,"28DEC20","X",null,null,null,null,"X",null,"PAXULD"]
[464,"Lufthansa","LH569","LOS",{"$f":"_xlfn.XLOOKUP(' Flight data base'!D465,'airport codes'!$D$3:$D$2103,'airport codes'!$C$3:$C$2103)","v":"Nigeria"},"FRA",{"$f":"_xlfn.XLOOKUP(' Flight data base'!F465,'airport codes'!$D$3:$D$2103,'airport codes'!$C$3:$C$2103)","v":"Germany"},"26DEC20",2350,620,"28DEC20","X",null,null,null,null,"X",null,"PAXULD"]
[465,"Lufthansa","LH569","SSG",{"$f":"_xlfn.XLOOKUP(' Flight data base'!D466,'airport codes'!$D$3:$D$2103,'airport codes'!$C$3:$C$2103)","v":"Equatorial Guinea"},"FRA",{"$f":"_xlfn.XLOOKUP(' Flight data base'!F466,'airport codes'!$D$3:$D$2103,'airport codes'!$C$3:$C$2103)","v":"Germany"},"30DEC20",2110,620,"30DEC20",null,null,"X",null,null,null,null,"PAXULD"]
[466,"Lufthansa","LH569","SSG",{"$f":"_xlfn.XLOOKUP(' Flight data base'!D467,'airport codes'!$D$3:$D$2103,'airport codes'!$C$3:$C$2103)","v":"Equatorial Guinea"},"LOS",{"$f":"_xlfn.XLOOKUP(' Flight data base'!F467,'airport codes'!$D$3:$D$2103,'airport codes'!$C$3:$C$2103)","v":"Nigeria"},"30DEC20",2110,2240,"30DEC20",null,null,"X",null,null,null,null,"PAXULD"]
[467,"Lufthansa","LH569","LOS",{"$f":"_xlfn.XLOOKUP(' Flight data base'!D468,'airport codes'!$D$3:$D$2103,'airport codes'!$C$3:$C$2103)","v":"Nigeria"},"FRA",{"$f":"_xlfn.XLOOKUP(' Flight data base'!F468,'airport codes'!$D$3:$D$2103,'airport codes'!$C$3:$C$2103)","v":"Germany"},"30DEC20",2350,620,"30DEC20",null,null,"X",null,null,null,null,"PAXULD"]
[468,"Lufthansa","LH569","SSG",{"$f":"_xlfn.XLOOKUP(' Flight data base'!D469,'airport codes'!$D$3:$D$2103,'airport codes'!$C$3:$C$2103)","v":"Equatorial Guinea"},"FRA",{"$f":"_xlfn.XLOOKUP(' Flight data base'!F469,'airport codes'!$D$3:$D$2103,'airport codes'!$C$3:$C$2103)","v":"Germany"},"2021-01-02",2110,620,"2021-01-02",null,null,null,null,null,"X",null,"PAXULD"]
[469,"Lufthansa","LH569","SSG",{"$f":"_xlfn.XLOOKUP(' Flight data base'!D470,'airport codes'!$D$3:$D$2103,'airport codes'!$C$3:$C$2103)","v":"Equatorial Guinea"},"LOS",{"$f":"_xlfn.XLOOKUP(' Flight data base'!F470,'airport codes'!$D$3:$D$2103,'airport codes'!$C$3:$C$2103)","v":"Nigeria"},"2021-01-02",2110,2240,"2021-01-02",null,null,null,null,null,"X",null,"PAXULD"]
[470,"Lufthansa","LH569","LOS",{"$f":"_xlfn.XLOOKUP(' Flight data base'!D471,'airport codes'!$D$3:$D$2103,'airport codes'!$C$3:$C$2103)","v":"Nigeria"},"FRA",{"$f":"_xlfn.XLOOKUP(' Flight data base'!F471,'airport codes'!$D$3:$D$2103,'airport codes'!$C$3:$C$2103)","v":"Germany"},"2021-01-02",2350,620,"2021-01-02",null,null,null,null,null,"X",null,"PAXULD"]
[471,"Lufthansa","LH569","SSG",{"$f":"_xlfn.XLOOKUP(' Flight data base'!D472,'airport codes'!$D$3:$D$2103,'airport codes'!$C$3:$C$2103)","v":"Equatorial Guinea"},"FRA",{"$f":"_xlfn.XLOOKUP(' Flight data base'!F472,'airport codes'!$D$3:$D$2103,'airport codes'!$C$3:$C$2103)","v":"Germany"},"2021-01-04",2110,620,"2021-01-06","X",null,"X",null,null,null,null,"PAXULD"]
[472,"Lufthansa","LH569","SSG",{"$f":"_xlfn.XLOOKUP(' Flight data base'!D473,'airport codes'!$D$3:$D$2103,'airport codes'!$C$3:$C$2103)","v":"Equatorial Guinea"},"LOS",{"$f":"_xlfn.XLOOKUP(' Flight data base'!F473,'airport codes'!$D$3:$D$2103,'airport codes'!$C$3:$C$2103)","v":"Nigeria"},"2021-01-04",2110,2240,"2021-01-06","X",null,"X",null,null,null,null,"PAXULD"]
[473,"Lufthansa","LH569","LOS",{"$f":"_xlfn.XLOOKUP(' Flight data base'!D474,'airport codes'!$D$3:$D$2103,'airport codes'!$C$3:$C$2103)","v":"Nigeria"},"FRA",{"$f":"_xlfn.XLOOKUP(' Flight data base'!F474,'airport codes'!$D$3:$D$2103,'airport codes'!$C$3:$C$2103)","v":"Germany"},"2021-01-04",2350,620,"2021-01-06","X",null,"X",null,null,null,null,"PAXULD"]
[474,"Lufthansa","LH569","SSG",{"$f":"_xlfn.XLOOKUP(' Flight data base'!D475,'airport codes'!$D$3:$D$2103,'airport codes'!$C$3:$C$2103)","v":"Equatorial Guinea"},"FRA",{"$f":"_xlfn.XLOOKUP(' Flight data base'!F475,'airport codes'!$D$3:$D$2103,'airport codes'!$C$3:$C$2103)","v":"Germany"},"2021-01-07",2110,620,"2021-01-15","X",null,"X","X","X",null,null,"PAXULD"]
[475,"Lufthansa","LH569","SSG",{"$f":"_xlfn.XLOOKUP(' Flight data base'!D476,'airport codes'!$D$3:$D$2103,'airport codes'!$C$3:$C$2103)","v":"Equatorial Guinea"},"LOS",{"$f":"_xlfn.XLOOKUP(' Flight data base'!F476,'airport codes'!$D$3:$D$2103,'airport codes'!$C$3:$C$2103)","v":"Nigeria"},"2021-01-07",2110,2240,"2021-01-15","X",null,"X","X","X",null,null,"PAXULD"]
[476,"Lufthansa","LH569","LOS",{"$f":"_xlfn.XLOOKUP(' Flight data base'!D477,'airport codes'!$D$3:$D$2103,'airport codes'!$C$3:$C$2103)","v":"Nigeria"},"FRA",{"$f":"_xlfn.XLOOKUP(' Flight data base'!F477,'airport codes'!$D$3:$D$2103,'airport codes'!$C$3:$C$2103)","v":"Germany"},"2021-01-07",2350,620,"2021-01-15","X",null,"X","X","X",null,null,"PAXULD"]
[477,"Lufthansa","LH569","SSG",{"$f":"_xlfn.XLOOKUP(' Flight data base'!D478,'airport codes'!$D$3:$D$2103,'airport codes'!$C$3:$C$2103)","v":"Equatorial Guinea"},"FRA",{"$f":"_xlfn.XLOOKUP(' Flight data base'!F478,'airport codes'!$D$3:$D$2103,'airport codes'!$C$3:$C$2103)","v":"Germany"},"2021-01-09",2110,620,"2021-01-10",null,null,null,null,null,"X","X","PAXULD"]
[478,"Lufthansa","LH569","SSG",{"$f":"_xlfn.XLOOKUP(' Flight data base'!D479,'airport codes'!$D$3:$D$2103,'airport codes'!$C$3:$C$2103)","v":"Equatorial Guinea"},"LOS",{"$f":"_xlfn.XLOOKUP(' Flight data base'!F479,'airport codes'!$D$3:$D$2103,'airport codes'!$C$3:$C$2103)","v":"Nigeria"},"2021-01-09",2110,2240,"2021-01-10",null,null,null,null,null,"X","X","PAXULD"]
[479,"Lufthansa","LH569","LOS",{"$f":"_xlfn.XLOOKUP(' Flight data base'!D480,'airport codes'!$D$3:$D$2103,'airport codes'!$C$3:$C$2103)","v":"Nigeria"},"FRA",{"$f":"_xlfn.XLOOKUP(' Flight data base'!F480,'airport codes'!$D$3:$D$2103,'airport codes'!$C$3:$C$2103)","v":"Germany"},"2021-01-09",2350,620,"2021-01-10",null,null,null,null,null,"X","X","PAXULD"]
[480,"Lufthansa","LH569","SSG",{"$f":"_xlfn.XLOOKUP(' Flight data base'!D481,'airport codes'!$D$3:$D$2103,'airport codes'!$C$3:$C$2103)","v":"Equatorial Guinea"},"FRA",{"$f":"_xlfn.XLOOKUP(' Flight data base'!F481,'airport codes'!$D$3:$D$2103,'airport codes'!$C$3:$C$2103)","v":"Germany"},"16DEC20",2110,620,"16DEC20",null,null,"X",null,null,null,null,"PAXULD"]
[481,"Lufthansa","LH569","SSG",{"$f":"_xlfn.XLOOKUP(' Flight data base'!D482,'airport codes'!$D$3:$D$2103,'airport codes'!$C$3:$C$2103)","v":"Equatorial Guinea"},"LOS",{"$f":"_xlfn.XLOOKUP(' Flight data base'!F482,'airport codes'!$D$3:$D$2103,'airport codes'!$C$3:$C$2103)","v":"Nigeria"},"16DEC20",2110,2240,"16DEC20",null,null,"X",null,null,null,null,"PAXULD"]
[482,"Lufthansa","LH569","LOS",{"$f":"_xlfn.XLOOKUP(' Flight data base'!D483,'airport codes'!$D$3:$D$2103,'airport codes'!$C$3:$C$2103)","v":"Nigeria"},"FRA",{"$f":"_xlfn.XLOOKUP(' Flight data base'!F483,'airport codes'!$D$3:$D$2103,'airport codes'!$C$3:$C$2103)","v":"Germany"},"16DEC20",2350,620,"16DEC20",null,null,"X",null,null,null,null,"PAXULD"]
[483,"Lufthansa","LH569","SSG",{"$f":"_xlfn.XLOOKUP(' Flight data base'!D484,'airport codes'!$D$3:$D$2103,'airport codes'!$C$3:$C$2103)","v":"Equatorial Guinea"},"FRA",{"$f":"_xlfn.XLOOKUP(' Flight data base'!F484,'airport codes'!$D$3:$D$2103,'airport codes'!$C$3:$C$2103)","v":"Germany"},"17DEC20",2110,620,"17DEC20",null,null,null,"X",null,null,null,"PAXULD"]
[484,"Lufthansa","LH569","SSG",{"$f":"_xlfn.XLOOKUP(' Flight data base'!D485,'airport codes'!$D$3:$D$2103,'airport codes'!$C$3:$C$2103)","v":"Equatorial Guinea"},"LOS",{"$f":"_xlfn.XLOOKUP(' Flight data base'!F485,'airport codes'!$D$3:$D$2103,'airport codes'!$C$3:$C$2103)","v":"Nigeria"},"17DEC20",2110,2240,"17DEC20",null,null,null,"X",null,null,null,"PAXULD"]
[485,"Lufthansa","LH569","LOS",{"$f":"_xlfn.XLOOKUP(' Flight data base'!D486,'airport codes'!$D$3:$D$2103,'airport codes'!$C$3:$C$2103)","v":"Nigeria"},"FRA",{"$f":"_xlfn.XLOOKUP(' Flight data base'!F486,'airport codes'!$D$3:$D$2103,'airport codes'!$C$3:$C$2103)","v":"Germany"},"17DEC20",2350,620,"17DEC20",null,null,null,"X",null,null,null,"PAXULD"]
[486,"Lufthansa","LH569","SSG",{"$f":"_xlfn.XLOOKUP(' Flight data base'!D487,'airport codes'!$D$3:$D$2103,'airport codes'!$C$3:$C$2103)","v":"Equatorial Guinea"},"FRA",{"$f":"_xlfn.XLOOKUP(' Flight data base'!F487,'airport codes'!$D$3:$D$2103,'airport codes'!$C$3:$C$2103)","v":"Germany"},"18DEC20",2110,620,"18DEC20",null,null,null,null,"X",null,null,"PAXULD"]
[487,"Lufthansa","LH569","SSG",{"$f":"_xlfn.XLOOKUP(' Flight data base'!D488,'airport codes'!$D$3:$D$2103,'airport codes'!$C$3:$C$2103)","v":"Equatorial Guinea"},"LOS",{"$f":"_xlfn.XLOOKUP(' Flight data base'!F488,'airport codes'!$D$3:$D$2103,'airport codes'!$C$3:$C$2103)","v":"Nigeria"},"18DEC20",2110,2240,"18DEC20",null,null,null,null,"X",null,null,"PAXULD"]
[488,"Lufthansa","LH569","LOS",{"$f":"_xlfn.XLOOKUP(' Flight data base'!D489,'airport codes'!$D$3:$D$2103,'airport codes'!$C$3:$C$2103)","v":"Nigeria"},"FRA",{"$f":"_xlfn.XLOOKUP(' Flight data base'!F489,'airport codes'!$D$3:$D$2103,'airport codes'!$C$3:$C$2103)","v":"Germany"},"18DEC20",2350,620,"18DEC20",null,null,null,null,"X",null,null,"PAXULD"]
[489,"Lufthansa","LH569","SSG",{"$f":"_xlfn.XLOOKUP(' Flight data base'!D490,'airport codes'!$D$3:$D$2103,'airport codes'!$C$3:$C$2103)","v":"Equatorial Guinea"},"FRA",{"$f":"_xlfn.XLOOKUP(' Flight data base'!F490,'airport codes'!$D$3:$D$2103,'airport codes'!$C$3:$C$2103)","v":"Germany"},"19DEC20",2110,620,"21DEC20","X",null,null,null,null,"X",null,"PAXULD"]
[490,"Lufthansa","LH569","SSG",{"$f":"_xlfn.XLOOKUP(' Flight data base'!D491,'airport codes'!$D$3:$D$2103,'airport codes'!$C$3:$C$2103)","v":"Equatorial Guinea"},"LOS",{"$f":"_xlfn.XLOOKUP(' Flight data base'!F491,'airport codes'!$D$3:$D$2103,'airport codes'!$C$3:$C$2103)","v":"Nigeria"},"19DEC20",2110,2240,"21DEC20","X",null,null,null,null,"X",null,"PAXULD"]
[491,"Lufthansa","LH569","LOS",{"$f":"_xlfn.XLOOKUP(' Flight data base'!D492,'airport codes'!$D$3:$D$2103,'airport codes'!$C$3:$C$2103)","v":"Nigeria"},"FRA",{"$f":"_xlfn.XLOOKUP(' Flight data base'!F492,'airport codes'!$D$3:$D$2103,'airport codes'!$C$3:$C$2103)","v":"Germany"},"19DEC20",2350,620,"21DEC20","X",null,null,null,null,"X",null,"PAXULD"]
[492,"Lufthansa","LH573","JNB",{"$f":"_xlfn.XLOOKUP(' Flight data base'!D493,'airport codes'!$D$3:$D$2103,'airport codes'!$C$3:$C$2103)","v":"South Africa"},"FRA",{"$f":"_xlfn.XLOOKUP(' Flight data base'!F493,'airport codes'!$D$3:$D$2103,'airport codes'!$C$3:$C$2103)","v":"Germany"},"21DEC20",1930,520,"21DEC20","X",null,null,null,null,null,null,"PAXULD"]
[493,"Lufthansa","LH573","JNB",{"$f":"_xlfn.XLOOKUP(' Flight data base'!D494,'airport codes'!$D$3:$D$2103,'airport codes'!$C$3:$C$2103)","v":"South Africa"},"FRA",{"$f":"_xlfn.XLOOKUP(' Flight data base'!F494,'airport codes'!$D$3:$D$2103,'airport codes'!$C$3:$C$2103)","v":"Germany"},"23DEC20",1930,520,"23DEC20",null,null,"X",null,null,null,null,"PAXULD"]
[494,"Lufthansa","LH573","JNB",{"$f":"_xlfn.XLOOKUP(' Flight data base'!D495,'airport codes'!$D$3:$D$2103,'airport codes'!$C$3:$C$2103)","v":"South Africa"},"FRA",{"$f":"_xlfn.XLOOKUP(' Flight data base'!F495,'airport codes'!$D$3:$D$2103,'airport codes'!$C$3:$C$2103)","v":"Germany"},"26DEC20",1930,520,"26DEC20",null,null,null,null,null,"X",null,"PAXULD"]
[495,"Lufthansa","LH573","JNB",{"$f":"_xlfn.XLOOKUP(' Flight data base'!D496,'airport codes'!$D$3:$D$2103,'airport codes'!$C$3:$C$2103)","v":"South Africa"},"FRA",{"$f":"_xlfn.XLOOKUP(' Flight data base'!F496,'airport codes'!$D$3:$D$2103,'airport codes'!$C$3:$C$2103)","v":"Germany"},"28DEC20",1930,520,"28DEC20","X",null,null,null,null,null,null,"PAXULD"]
[496,"Lufthansa","LH573","JNB",{"$f":"_xlfn.XLOOKUP(' Flight data base'!D497,'airport codes'!$D$3:$D$2103,'airport codes'!$C$3:$C$2103)","v":"South Africa"},"FRA",{"$f":"_xlfn.XLOOKUP(' Flight data base'!F497,'airport codes'!$D$3:$D$2103,'airport codes'!$C$3:$C$2103)","v":"Germany"},"30DEC20",1930,520,"30DEC20",null,null,"X",null,null,null,null,"PAXULD"]
[497,"Lufthansa","LH573","JNB",{"$f":"_xlfn.XLOOKUP(' Flight data base'!D498,'airport codes'!$D$3:$D$2103,'airport codes'!$C$3:$C$2103)","v":"South Africa"},"FRA",{"$f":"_xlfn.XLOOKUP(' Flight data base'!F498,'airport codes'!$D$3:$D$2103,'airport codes'!$C$3:$C$2103)","v":"Germany"},"2021-01-02",1930,520,"2021-01-02",null,null,null,null,null,"X",null,"PAXULD"]
[498,"Lufthansa","LH573","JNB",{"$f":"_xlfn.XLOOKUP(' Flight data base'!D499,'airport codes'!$D$3:$D$2103,'airport codes'!$C$3:$C$2103)","v":"South Africa"},"FRA",{"$f":"_xlfn.XLOOKUP(' Flight data base'!F499,'airport codes'!$D$3:$D$2103,'airport codes'!$C$3:$C$2103)","v":"Germany"},"27DEC20",1930,520,"27DEC20",null,null,null,null,null,null,"X","PAXULD"]
[499,"Lufthansa","LH573","JNB",{"$f":"_xlfn.XLOOKUP(' Flight data base'!D500,'airport codes'!$D$3:$D$2103,'airport codes'!$C$3:$C$2103)","v":"South Africa"},"FRA",{"$f":"_xlfn.XLOOKUP(' Flight data base'!F500,'airport codes'!$D$3:$D$2103,'airport codes'!$C$3:$C$2103)","v":"Germany"},"2021-01-03",1930,520,"28FEB21",null,null,null,null,"X",null,"X","PAXULD"]
[500,"Lufthansa","LH573","JNB",{"$f":"_xlfn.XLOOKUP(' Flight data base'!D501,'airport codes'!$D$3:$D$2103,'airport codes'!$C$3:$C$2103)","v":"South Africa"},"FRA",{"$f":"_xlfn.XLOOKUP(' Flight data base'!F501,'airport codes'!$D$3:$D$2103,'airport codes'!$C$3:$C$2103)","v":"Germany"},"2021-01-04",1930,520,"2021-01-04","X",null,null,null,null,null,null,"PAXULD"]
[501,"Lufthansa","LH573","JNB",{"$f":"_xlfn.XLOOKUP(' Flight data base'!D502,'airport codes'!$D$3:$D$2103,'airport codes'!$C$3:$C$2103)","v":"South Africa"},"FRA",{"$f":"_xlfn.XLOOKUP(' Flight data base'!F502,'airport codes'!$D$3:$D$2103,'airport codes'!$C$3:$C$2103)","v":"Germany"},"2021-01-06",1930,520,"2021-01-06",null,null,"X",null,null,null,null,"PAXULD"]
[502,"Lufthansa","LH573","JNB",{"$f":"_xlfn.XLOOKUP(' Flight data base'!D503,'airport codes'!$D$3:$D$2103,'airport codes'!$C$3:$C$2103)","v":"South Africa"},"FRA",{"$f":"_xlfn.XLOOKUP(' Flight data base'!F503,'airport codes'!$D$3:$D$2103,'airport codes'!$C$3:$C$2103)","v":"Germany"},"2021-01-09",1930,520,"27FEB21","X",null,"X",null,null,"X",null,"PAXULD"]
[503,"Lufthansa","LH573","JNB",{"$f":"_xlfn.XLOOKUP(' Flight data base'!D504,'airport codes'!$D$3:$D$2103,'airport codes'!$C$3:$C$2103)","v":"South Africa"},"FRA",{"$f":"_xlfn.XLOOKUP(' Flight data base'!F504,'airport codes'!$D$3:$D$2103,'airport codes'!$C$3:$C$2103)","v":"Germany"},"14DEC20",1930,520,"19DEC20","X",null,"X",null,null,"X",null,"PAXULD"]
[504,"Lufthansa","LH573","JNB",{"$f":"_xlfn.XLOOKUP(' Flight data base'!D505,'airport codes'!$D$3:$D$2103,'airport codes'!$C$3:$C$2103)","v":"South Africa"},"FRA",{"$f":"_xlfn.XLOOKUP(' Flight data base'!F505,'airport codes'!$D$3:$D$2103,'airport codes'!$C$3:$C$2103)","v":"Germany"},"18DEC20",1930,520,"20DEC20",null,null,null,null,"X",null,"X","PAXULD"]
[505,"Lufthansa","LH573","JNB",{"$f":"_xlfn.XLOOKUP(' Flight data base'!D506,'airport codes'!$D$3:$D$2103,'airport codes'!$C$3:$C$2103)","v":"South Africa"},"FRA",{"$f":"_xlfn.XLOOKUP(' Flight data base'!F506,'airport codes'!$D$3:$D$2103,'airport codes'!$C$3:$C$2103)","v":"Germany"},"15DEC20",1930,555,"15DEC20",null,"X",null,null,null,null,null,"PAXULD"]
[506,"Lufthansa","LH575","CPT",{"$f":"_xlfn.XLOOKUP(' Flight data base'!D507,'airport codes'!$D$3:$D$2103,'airport codes'!$C$3:$C$2103)","v":"South Africa"},"MUC",{"$f":"_xlfn.XLOOKUP(' Flight data base'!F507,'airport codes'!$D$3:$D$2103,'airport codes'!$C$3:$C$2103)","v":"Germany"},"16DEC20",1925,545,"18DEC20",null,null,"X",null,"X",null,null,"PAXULD"]
[507,"Lufthansa","LH575","CPT",{"$f":"_xlfn.XLOOKUP(' Flight data base'!D508,'airport codes'!$D$3:$D$2103,'airport codes'!$C$3:$C$2103)","v":"South Africa"},"MUC",{"$f":"_xlfn.XLOOKUP(' Flight data base'!F508,'airport codes'!$D$3:$D$2103,'airport codes'!$C$3:$C$2103)","v":"Germany"},"21DEC20",1925,545,"23DEC20","X",null,"X",null,null,null,null,"PAXULD"]
[508,"Lufthansa","LH575","CPT",{"$f":"_xlfn.XLOOKUP(' Flight data base'!D509,'airport codes'!$D$3:$D$2103,'airport codes'!$C$3:$C$2103)","v":"South Africa"},"MUC",{"$f":"_xlfn.XLOOKUP(' Flight data base'!F509,'airport codes'!$D$3:$D$2103,'airport codes'!$C$3:$C$2103)","v":"Germany"},"22DEC20",1925,545,"24DEC20",null,"X",null,"X",null,null,null,"PAXULD"]
[509,"Lufthansa","LH575","CPT",{"$f":"_xlfn.XLOOKUP(' Flight data base'!D510,'airport codes'!$D$3:$D$2103,'airport codes'!$C$3:$C$2103)","v":"South Africa"},"MUC",{"$f":"_xlfn.XLOOKUP(' Flight data base'!F510,'airport codes'!$D$3:$D$2103,'airport codes'!$C$3:$C$2103)","v":"Germany"},"28DEC20",1925,545,"30DEC20","X",null,"X",null,null,null,null,"PAXULD"]
[510,"Lufthansa","LH575","CPT",{"$f":"_xlfn.XLOOKUP(' Flight data base'!D511,'airport codes'!$D$3:$D$2103,'airport codes'!$C$3:$C$2103)","v":"South Africa"},"MUC",{"$f":"_xlfn.XLOOKUP(' Flight data base'!F511,'airport codes'!$D$3:$D$2103,'airport codes'!$C$3:$C$2103)","v":"Germany"},"2021-01-04",1925,545,"2021-01-06","X",null,"X",null,null,null,null,"PAXULD"]
[511,"Lufthansa","LH575","CPT",{"$f":"_xlfn.XLOOKUP(' Flight data base'!D512,'airport codes'!$D$3:$D$2103,'airport codes'!$C$3:$C$2103)","v":"South Africa"},"MUC",{"$f":"_xlfn.XLOOKUP(' Flight data base'!F512,'airport codes'!$D$3:$D$2103,'airport codes'!$C$3:$C$2103)","v":"Germany"},"2021-01-05",1925,545,"2021-01-07",null,"X",null,"X",null,null,null,"PAXULD"]
[512,"Lufthansa","LH575","CPT",{"$f":"_xlfn.XLOOKUP(' Flight data base'!D513,'airport codes'!$D$3:$D$2103,'airport codes'!$C$3:$C$2103)","v":"South Africa"},"MUC",{"$f":"_xlfn.XLOOKUP(' Flight data base'!F513,'airport codes'!$D$3:$D$2103,'airport codes'!$C$3:$C$2103)","v":"Germany"},"2021-01-08",1925,545,"2021-03-26","X",null,"X",null,"X",null,null,"PAXULD"]
[513,"Lufthansa","LH575","CPT",{"$f":"_xlfn.XLOOKUP(' Flight data base'!D514,'airport codes'!$D$3:$D$2103,'airport codes'!$C$3:$C$2103)","v":"South Africa"},"MUC",{"$f":"_xlfn.XLOOKUP(' Flight data base'!F514,'airport codes'!$D$3:$D$2103,'airport codes'!$C$3:$C$2103)","v":"Germany"},"20DEC20",2015,635,"20DEC20",null,null,null,null,null,null,"X","PAXULD"]
[514,"Lufthansa","LH577","CPT",{"$f":"_xlfn.XLOOKUP(' Flight data base'!D515,'airport codes'!$D$3:$D$2103,'airport codes'!$C$3:$C$2103)","v":"South Africa"},"FRA",{"$f":"_xlfn.XLOOKUP(' Flight data base'!F515,'airport codes'!$D$3:$D$2103,'airport codes'!$C$3:$C$2103)","v":"Germany"},"17DEC20",1820,525,"2021-03-20",null,"X",null,"X",null,"X",null,"PAXULD"]
[515,"Lufthansa","LH577","CPT",{"$f":"_xlfn.XLOOKUP(' Flight data base'!D516,'airport codes'!$D$3:$D$2103,'airport codes'!$C$3:$C$2103)","v":"South Africa"},"FRA",{"$f":"_xlfn.XLOOKUP(' Flight data base'!F516,'airport codes'!$D$3:$D$2103,'airport codes'!$C$3:$C$2103)","v":"Germany"},"15DEC20",1820,525,"15DEC20",null,"X",null,null,null,null,null,"PAXULD"]
[516,"Lufthansa","LH581","CAI",{"$f":"_xlfn.XLOOKUP(' Flight data base'!D517,'airport codes'!$D$3:$D$2103,'airport codes'!$C$3:$C$2103)","v":"Egypt"},"FRA",{"$f":"_xlfn.XLOOKUP(' Flight data base'!F517,'airport codes'!$D$3:$D$2103,'airport codes'!$C$3:$C$2103)","v":"Germany"},"26DEC20",155,530,"26DEC20",null,null,null,null,null,"X",null,"PAXULD"]
[517,"Lufthansa","LH581","CAI",{"$f":"_xlfn.XLOOKUP(' Flight data base'!D518,'airport codes'!$D$3:$D$2103,'airport codes'!$C$3:$C$2103)","v":"Egypt"},"FRA",{"$f":"_xlfn.XLOOKUP(' Flight data base'!F518,'airport codes'!$D$3:$D$2103,'airport codes'!$C$3:$C$2103)","v":"Germany"},"27DEC20",155,535,"27DEC20",null,null,null,null,null,null,"X","PAXULD"]
[518,"Lufthansa","LH581","CAI",{"$f":"_xlfn.XLOOKUP(' Flight data base'!D519,'airport codes'!$D$3:$D$2103,'airport codes'!$C$3:$C$2103)","v":"Egypt"},"FRA",{"$f":"_xlfn.XLOOKUP(' Flight data base'!F519,'airport codes'!$D$3:$D$2103,'airport codes'!$C$3:$C$2103)","v":"Germany"},"28DEC20",155,530,"31DEC20","X","X","X","X",null,null,null,"PAXULD"]
[519,"Lufthansa","LH581","CAI",{"$f":"_xlfn.XLOOKUP(' Flight data base'!D520,'airport codes'!$D$3:$D$2103,'airport codes'!$C$3:$C$2103)","v":"Egypt"},"FRA",{"$f":"_xlfn.XLOOKUP(' Flight data base'!F520,'airport codes'!$D$3:$D$2103,'airport codes'!$C$3:$C$2103)","v":"Germany"},"2021-01-02",155,535,"2021-01-02",null,null,null,null,null,"X",null,"PAXULD"]
[520,"Lufthansa","LH581","CAI",{"$f":"_xlfn.XLOOKUP(' Flight data base'!D521,'airport codes'!$D$3:$D$2103,'airport codes'!$C$3:$C$2103)","v":"Egypt"},"FRA",{"$f":"_xlfn.XLOOKUP(' Flight data base'!F521,'airport codes'!$D$3:$D$2103,'airport codes'!$C$3:$C$2103)","v":"Germany"},"2021-01-03",155,530,"2021-01-03",null,null,null,null,null,null,"X","PAXULD"]
[521,"Lufthansa","LH581","CAI",{"$f":"_xlfn.XLOOKUP(' Flight data base'!D522,'airport codes'!$D$3:$D$2103,'airport codes'!$C$3:$C$2103)","v":"Egypt"},"FRA",{"$f":"_xlfn.XLOOKUP(' Flight data base'!F522,'airport codes'!$D$3:$D$2103,'airport codes'!$C$3:$C$2103)","v":"Germany"},"2021-01-04",155,530,"2021-01-04","X",null,null,null,null,null,null,"PAXULD"]
[522,"Lufthansa","LH581","CAI",{"$f":"_xlfn.XLOOKUP(' Flight data base'!D523,'airport codes'!$D$3:$D$2103,'airport codes'!$C$3:$C$2103)","v":"Egypt"},"FRA",{"$f":"_xlfn.XLOOKUP(' Flight data base'!F523,'airport codes'!$D$3:$D$2103,'airport codes'!$C$3:$C$2103)","v":"Germany"},"2021-01-05",155,530,"2021-01-05",null,"X",null,null,null,null,null,"PAXULD"]
[523,"Lufthansa","LH581","CAI",{"$f":"_xlfn.XLOOKUP(' Flight data base'!D524,'airport codes'!$D$3:$D$2103,'airport codes'!$C$3:$C$2103)","v":"Egypt"},"FRA",{"$f":"_xlfn.XLOOKUP(' Flight data base'!F524,'airport codes'!$D$3:$D$2103,'airport codes'!$C$3:$C$2103)","v":"Germany"},"2021-01-06",155,530,"2021-01-07",null,null,"X","X",null,null,null,"PAXULD"]
[524,"Lufthansa","LH581","CAI",{"$f":"_xlfn.XLOOKUP(' Flight data base'!D525,'airport codes'!$D$3:$D$2103,'airport codes'!$C$3:$C$2103)","v":"Egypt"},"FRA",{"$f":"_xlfn.XLOOKUP(' Flight data base'!F525,'airport codes'!$D$3:$D$2103,'airport codes'!$C$3:$C$2103)","v":"Germany"},"2021-01-08",155,535,"2021-01-08",null,null,null,null,"X",null,null,"PAXULD"]
[525,"Lufthansa","LH581","CAI",{"$f":"_xlfn.XLOOKUP(' Flight data base'!D526,'airport codes'!$D$3:$D$2103,'airport codes'!$C$3:$C$2103)","v":"Egypt"},"FRA",{"$f":"_xlfn.XLOOKUP(' Flight data base'!F526,'airport codes'!$D$3:$D$2103,'airport codes'!$C$3:$C$2103)","v":"Germany"},"2021-01-09",155,530,"2021-01-10",null,null,null,null,null,"X","X","PAXULD"]
[526,"Lufthansa","LH581","CAI",{"$f":"_xlfn.XLOOKUP(' Flight data base'!D527,'airport codes'!$D$3:$D$2103,'airport codes'!$C$3:$C$2103)","v":"Egypt"},"FRA",{"$f":"_xlfn.XLOOKUP(' Flight data base'!F527,'airport codes'!$D$3:$D$2103,'airport codes'!$C$3:$C$2103)","v":"Germany"},"2021-01-11",155,530,"2021-01-11","X",null,null,null,null,null,null,"PAXULD"]
[527,"Lufthansa","LH581","CAI",{"$f":"_xlfn.XLOOKUP(' Flight data base'!D528,'airport codes'!$D$3:$D$2103,'airport codes'!$C$3:$C$2103)","v":"Egypt"},"FRA",{"$f":"_xlfn.XLOOKUP(' Flight data base'!F528,'airport codes'!$D$3:$D$2103,'airport codes'!$C$3:$C$2103)","v":"Germany"},"15DEC20",155,530,"15DEC20",null,"X",null,null,null,null,null,"PAXULD"]
[528,"Lufthansa","LH581","CAI",{"$f":"_xlfn.XLOOKUP(' Flight data base'!D529,'airport codes'!$D$3:$D$2103,'airport codes'!$C$3:$C$2103)","v":"Egypt"},"FRA",{"$f":"_xlfn.XLOOKUP(' Flight data base'!F529,'airport codes'!$D$3:$D$2103,'airport codes'!$C$3:$C$2103)","v":"Germany"},"2021-01-12",155,530,"2021-03-27","X","X","X","X","X","X","X","PAXULD"]
[529,"Lufthansa","LH581","CAI",{"$f":"_xlfn.XLOOKUP(' Flight data base'!D530,'airport codes'!$D$3:$D$2103,'airport codes'!$C$3:$C$2103)","v":"Egypt"},"FRA",{"$f":"_xlfn.XLOOKUP(' Flight data base'!F530,'airport codes'!$D$3:$D$2103,'airport codes'!$C$3:$C$2103)","v":"Germany"},"16DEC20",155,530,"16DEC20",null,null,"X",null,null,null,null,"PAXULD"]
[530,"Lufthansa","LH581","CAI",{"$f":"_xlfn.XLOOKUP(' Flight data base'!D531,'airport codes'!$D$3:$D$2103,'airport codes'!$C$3:$C$2103)","v":"Egypt"},"FRA",{"$f":"_xlfn.XLOOKUP(' Flight data base'!F531,'airport codes'!$D$3:$D$2103,'airport codes'!$C$3:$C$2103)","v":"Germany"},"17DEC20",155,530,"24DEC20","X","X","X","X","X","X","X","PAXULD"]
[531,"Lufthansa","LH591","NBO",{"$f":"_xlfn.XLOOKUP(' Flight data base'!D532,'airport codes'!$D$3:$D$2103,'airport codes'!$C$3:$C$2103)","v":"Kenya"},"FRA",{"$f":"_xlfn.XLOOKUP(' Flight data base'!F532,'airport codes'!$D$3:$D$2103,'airport codes'!$C$3:$C$2103)","v":"Germany"},"19DEC20",2300,530,"19DEC20",null,null,null,null,null,"X",null,"PAXULD"]
[532,"Lufthansa","LH591","NBO",{"$f":"_xlfn.XLOOKUP(' Flight data base'!D533,'airport codes'!$D$3:$D$2103,'airport codes'!$C$3:$C$2103)","v":"Kenya"},"FRA",{"$f":"_xlfn.XLOOKUP(' Flight data base'!F533,'airport codes'!$D$3:$D$2103,'airport codes'!$C$3:$C$2103)","v":"Germany"},"20DEC20",2300,530,"22DEC20",null,"X",null,null,null,null,"X","PAXULD"]
[533,"Lufthansa","LH591","NBO",{"$f":"_xlfn.XLOOKUP(' Flight data base'!D534,'airport codes'!$D$3:$D$2103,'airport codes'!$C$3:$C$2103)","v":"Kenya"},"FRA",{"$f":"_xlfn.XLOOKUP(' Flight data base'!F534,'airport codes'!$D$3:$D$2103,'airport codes'!$C$3:$C$2103)","v":"Germany"},"26DEC20",2300,530,"26DEC20",null,null,null,null,null,"X",null,"PAXULD"]
[534,"Lufthansa","LH591","NBO",{"$f":"_xlfn.XLOOKUP(' Flight data base'!D535,'airport codes'!$D$3:$D$2103,'airport codes'!$C$3:$C$2103)","v":"Kenya"},"FRA",{"$f":"_xlfn.XLOOKUP(' Flight data base'!F535,'airport codes'!$D$3:$D$2103,'airport codes'!$C$3:$C$2103)","v":"Germany"},"27DEC20",2300,530,"27DEC20",null,null,null,null,null,null,"X","PAXULD"]
[535,"Lufthansa","LH591","NBO",{"$f":"_xlfn.XLOOKUP(' Flight data base'!D536,'airport codes'!$D$3:$D$2103,'airport codes'!$C$3:$C$2103)","v":"Kenya"},"FRA",{"$f":"_xlfn.XLOOKUP(' Flight data base'!F536,'airport codes'!$D$3:$D$2103,'airport codes'!$C$3:$C$2103)","v":"Germany"},"29DEC20",2300,530,"29DEC20",null,"X",null,null,null,null,null,"PAXULD"]
[536,"Lufthansa","LH591","NBO",{"$f":"_xlfn.XLOOKUP(' Flight data base'!D537,'airport codes'!$D$3:$D$2103,'airport codes'!$C$3:$C$2103)","v":"Kenya"},"FRA",{"$f":"_xlfn.XLOOKUP(' Flight data base'!F537,'airport codes'!$D$3:$D$2103,'airport codes'!$C$3:$C$2103)","v":"Germany"},"2021-01-02",2300,530,"2021-01-02",null,null,null,null,null,"X",null,"PAXULD"]
[537,"Lufthansa","LH591","NBO",{"$f":"_xlfn.XLOOKUP(' Flight data base'!D538,'airport codes'!$D$3:$D$2103,'airport codes'!$C$3:$C$2103)","v":"Kenya"},"FRA",{"$f":"_xlfn.XLOOKUP(' Flight data base'!F538,'airport codes'!$D$3:$D$2103,'airport codes'!$C$3:$C$2103)","v":"Germany"},"2021-01-03",2300,530,"2021-01-03",null,null,null,null,null,null,"X","PAXULD"]
[538,"Lufthansa","LH591","NBO",{"$f":"_xlfn.XLOOKUP(' Flight data base'!D539,'airport codes'!$D$3:$D$2103,'airport codes'!$C$3:$C$2103)","v":"Kenya"},"FRA",{"$f":"_xlfn.XLOOKUP(' Flight data base'!F539,'airport codes'!$D$3:$D$2103,'airport codes'!$C$3:$C$2103)","v":"Germany"},"2021-01-05",2300,530,"2021-01-05",null,"X",null,null,null,null,null,"PAXULD"]
[539,"Lufthansa","LH591","NBO",{"$f":"_xlfn.XLOOKUP(' Flight data base'!D540,'airport codes'!$D$3:$D$2103,'airport codes'!$C$3:$C$2103)","v":"Kenya"},"FRA",{"$f":"_xlfn.XLOOKUP(' Flight data base'!F540,'airport codes'!$D$3:$D$2103,'airport codes'!$C$3:$C$2103)","v":"Germany"},"2021-01-07",2300,530,"2021-01-07",null,null,null,"X",null,null,null,"PAXULD"]
[540,"Lufthansa","LH591","NBO",{"$f":"_xlfn.XLOOKUP(' Flight data base'!D541,'airport codes'!$D$3:$D$2103,'airport codes'!$C$3:$C$2103)","v":"Kenya"},"FRA",{"$f":"_xlfn.XLOOKUP(' Flight data base'!F541,'airport codes'!$D$3:$D$2103,'airport codes'!$C$3:$C$2103)","v":"Germany"},"2021-01-08",2300,530,"2021-01-08",null,null,null,null,"X",null,null,"PAXULD"]
[541,"Lufthansa","LH591","NBO",{"$f":"_xlfn.XLOOKUP(' Flight data base'!D542,'airport codes'!$D$3:$D$2103,'airport codes'!$C$3:$C$2103)","v":"Kenya"},"FRA",{"$f":"_xlfn.XLOOKUP(' Flight data base'!F542,'airport codes'!$D$3:$D$2103,'airport codes'!$C$3:$C$2103)","v":"Germany"},"2021-01-09",2300,530,"2021-01-09",null,null,null,null,null,"X",null,"PAXULD"]
[542,"Lufthansa","LH591","NBO",{"$f":"_xlfn.XLOOKUP(' Flight data base'!D543,'airport codes'!$D$3:$D$2103,'airport codes'!$C$3:$C$2103)","v":"Kenya"},"FRA",{"$f":"_xlfn.XLOOKUP(' Flight data base'!F543,'airport codes'!$D$3:$D$2103,'airport codes'!$C$3:$C$2103)","v":"Germany"},"2021-01-10",2300,530,"2021-01-10",null,null,null,null,null,null,"X","PAXULD"]
[543,"Lufthansa","LH591","NBO",{"$f":"_xlfn.XLOOKUP(' Flight data base'!D544,'airport codes'!$D$3:$D$2103,'airport codes'!$C$3:$C$2103)","v":"Kenya"},"FRA",{"$f":"_xlfn.XLOOKUP(' Flight data base'!F544,'airport codes'!$D$3:$D$2103,'airport codes'!$C$3:$C$2103)","v":"Germany"},"2021-01-12",2300,530,"2021-01-14",null,"X",null,"X",null,null,null,"PAXULD"]
[544,"Lufthansa","LH591","NBO",{"$f":"_xlfn.XLOOKUP(' Flight data base'!D545,'airport codes'!$D$3:$D$2103,'airport codes'!$C$3:$C$2103)","v":"Kenya"},"FRA",{"$f":"_xlfn.XLOOKUP(' Flight data base'!F545,'airport codes'!$D$3:$D$2103,'airport codes'!$C$3:$C$2103)","v":"Germany"},"17DEC20",2300,530,"17DEC20",null,null,null,"X",null,null,null,"PAXULD"]
[545,"Lufthansa","LH591","NBO",{"$f":"_xlfn.XLOOKUP(' Flight data base'!D546,'airport codes'!$D$3:$D$2103,'airport codes'!$C$3:$C$2103)","v":"Kenya"},"FRA",{"$f":"_xlfn.XLOOKUP(' Flight data base'!F546,'airport codes'!$D$3:$D$2103,'airport codes'!$C$3:$C$2103)","v":"Germany"},"18DEC20",2300,530,"18DEC20",null,null,null,null,"X",null,null,"PAXULD"]
[546,"Lufthansa","LH591","NBO",{"$f":"_xlfn.XLOOKUP(' Flight data base'!D547,'airport codes'!$D$3:$D$2103,'airport codes'!$C$3:$C$2103)","v":"Kenya"},"FRA",{"$f":"_xlfn.XLOOKUP(' Flight data base'!F547,'airport codes'!$D$3:$D$2103,'airport codes'!$C$3:$C$2103)","v":"Germany"},"15DEC20",2300,530,"15DEC20",null,"X",null,null,null,null,null,"PAXULD"]
[547,"Lufthansa","LH594","ABV",{"$f":"_xlfn.XLOOKUP(' Flight data base'!D548,'airport codes'!$D$3:$D$2103,'airport codes'!$C$3:$C$2103)","v":"Nigeria"},"PHC",{"$f":"_xlfn.XLOOKUP(' Flight data base'!F548,'airport codes'!$D$3:$D$2103,'airport codes'!$C$3:$C$2103)","v":"Nigeria"},"22DEC20",1820,1930,"22DEC20",null,"X",null,null,null,null,null,"PAXULD"]
[548,"Lufthansa","LH594","ABV",{"$f":"_xlfn.XLOOKUP(' Flight data base'!D549,'airport codes'!$D$3:$D$2103,'airport codes'!$C$3:$C$2103)","v":"Nigeria"},"PHC",{"$f":"_xlfn.XLOOKUP(' Flight data base'!F549,'airport codes'!$D$3:$D$2103,'airport codes'!$C$3:$C$2103)","v":"Nigeria"},"26DEC20",1820,1930,"26DEC20",null,null,null,null,null,"X",null,"PAXULD"]
[549,"Lufthansa","LH594","ABV",{"$f":"_xlfn.XLOOKUP(' Flight data base'!D550,'airport codes'!$D$3:$D$2103,'airport codes'!$C$3:$C$2103)","v":"Nigeria"},"PHC",{"$f":"_xlfn.XLOOKUP(' Flight data base'!F550,'airport codes'!$D$3:$D$2103,'airport codes'!$C$3:$C$2103)","v":"Nigeria"},"27DEC20",1820,1930,"29DEC20",null,"X",null,null,null,null,"X","PAXULD"]
[550,"Lufthansa","LH594","ABV",{"$f":"_xlfn.XLOOKUP(' Flight data base'!D551,'airport codes'!$D$3:$D$2103,'airport codes'!$C$3:$C$2103)","v":"Nigeria"},"PHC",{"$f":"_xlfn.XLOOKUP(' Flight data base'!F551,'airport codes'!$D$3:$D$2103,'airport codes'!$C$3:$C$2103)","v":"Nigeria"},"2021-01-02",1820,1930,"2021-01-02",null,null,null,null,null,"X",null,"PAXULD"]
[551,"Lufthansa","LH594","ABV",{"$f":"_xlfn.XLOOKUP(' Flight data base'!D552,'airport codes'!$D$3:$D$2103,'airport codes'!$C$3:$C$2103)","v":"Nigeria"},"PHC",{"$f":"_xlfn.XLOOKUP(' Flight data base'!F552,'airport codes'!$D$3:$D$2103,'airport codes'!$C$3:$C$2103)","v":"Nigeria"},"2021-01-03",1820,1930,"2021-01-03",null,null,null,null,null,null,"X","PAXULD"]
[552,"Lufthansa","LH594","ABV",{"$f":"_xlfn.XLOOKUP(' Flight data base'!D553,'airport codes'!$D$3:$D$2103,'airport codes'!$C$3:$C$2103)","v":"Nigeria"},"PHC",{"$f":"_xlfn.XLOOKUP(' Flight data base'!F553,'airport codes'!$D$3:$D$2103,'airport codes'!$C$3:$C$2103)","v":"Nigeria"},"2021-01-05",1820,1930,"2021-01-05",null,"X",null,null,null,null,null,"PAXULD"]
[553,"Lufthansa","LH594","ABV",{"$f":"_xlfn.XLOOKUP(' Flight data base'!D554,'airport codes'!$D$3:$D$2103,'airport codes'!$C$3:$C$2103)","v":"Nigeria"},"PHC",{"$f":"_xlfn.XLOOKUP(' Flight data base'!F554,'airport codes'!$D$3:$D$2103,'airport codes'!$C$3:$C$2103)","v":"Nigeria"},"2021-01-07",1820,1930,"25FEB21",null,null,null,"X",null,null,null,"PAXULD"]
[554,"Lufthansa","LH594","ABV",{"$f":"_xlfn.XLOOKUP(' Flight data base'!D555,'airport codes'!$D$3:$D$2103,'airport codes'!$C$3:$C$2103)","v":"Nigeria"},"PHC",{"$f":"_xlfn.XLOOKUP(' Flight data base'!F555,'airport codes'!$D$3:$D$2103,'airport codes'!$C$3:$C$2103)","v":"Nigeria"},"2021-01-09",1820,1930,"2021-01-09",null,null,null,null,null,"X",null,"PAXULD"]
[555,"Lufthansa","LH594","ABV",{"$f":"_xlfn.XLOOKUP(' Flight data base'!D556,'airport codes'!$D$3:$D$2103,'airport codes'!$C$3:$C$2103)","v":"Nigeria"},"PHC",{"$f":"_xlfn.XLOOKUP(' Flight data base'!F556,'airport codes'!$D$3:$D$2103,'airport codes'!$C$3:$C$2103)","v":"Nigeria"},"2021-01-10",1820,1930,"2021-01-10",null,null,null,null,null,null,"X","PAXULD"]
[556,"Lufthansa","LH594","ABV",{"$f":"_xlfn.XLOOKUP(' Flight data base'!D557,'airport codes'!$D$3:$D$2103,'airport codes'!$C$3:$C$2103)","v":"Nigeria"},"PHC",{"$f":"_xlfn.XLOOKUP(' Flight data base'!F557,'airport codes'!$D$3:$D$2103,'airport codes'!$C$3:$C$2103)","v":"Nigeria"},"2021-01-12",1820,1930,"2021-01-12",null,"X",null,null,null,null,null,"PAXULD"]
[557,"Lufthansa","LH595","PHC",{"$f":"_xlfn.XLOOKUP(' Flight data base'!D558,'airport codes'!$D$3:$D$2103,'airport codes'!$C$3:$C$2103)","v":"Nigeria"},"FRA",{"$f":"_xlfn.XLOOKUP(' Flight data base'!F558,'airport codes'!$D$3:$D$2103,'airport codes'!$C$3:$C$2103)","v":"Germany"},"23DEC20",2040,530,"23DEC20",null,null,"X",null,null,null,null,"PAXULD"]
[558,"Lufthansa","LH595","PHC",{"$f":"_xlfn.XLOOKUP(' Flight data base'!D559,'airport codes'!$D$3:$D$2103,'airport codes'!$C$3:$C$2103)","v":"Nigeria"},"ABV",{"$f":"_xlfn.XLOOKUP(' Flight data base'!F559,'airport codes'!$D$3:$D$2103,'airport codes'!$C$3:$C$2103)","v":"Nigeria"},"23DEC20",2040,2150,"23DEC20",null,null,"X",null,null,null,null,"PAXULD"]
[559,"Lufthansa","LH595","ABV",{"$f":"_xlfn.XLOOKUP(' Flight data base'!D560,'airport codes'!$D$3:$D$2103,'airport codes'!$C$3:$C$2103)","v":"Nigeria"},"FRA",{"$f":"_xlfn.XLOOKUP(' Flight data base'!F560,'airport codes'!$D$3:$D$2103,'airport codes'!$C$3:$C$2103)","v":"Germany"},"23DEC20",2310,530,"23DEC20",null,null,"X",null,null,null,null,"PAXULD"]
[560,"Lufthansa","LH595","PHC",{"$f":"_xlfn.XLOOKUP(' Flight data base'!D561,'airport codes'!$D$3:$D$2103,'airport codes'!$C$3:$C$2103)","v":"Nigeria"},"FRA",{"$f":"_xlfn.XLOOKUP(' Flight data base'!F561,'airport codes'!$D$3:$D$2103,'airport codes'!$C$3:$C$2103)","v":"Germany"},"27DEC20",2040,530,"27DEC20",null,null,null,null,null,null,"X","PAXULD"]
[561,"Lufthansa","LH595","PHC",{"$f":"_xlfn.XLOOKUP(' Flight data base'!D562,'airport codes'!$D$3:$D$2103,'airport codes'!$C$3:$C$2103)","v":"Nigeria"},"ABV",{"$f":"_xlfn.XLOOKUP(' Flight data base'!F562,'airport codes'!$D$3:$D$2103,'airport codes'!$C$3:$C$2103)","v":"Nigeria"},"27DEC20",2040,2150,"27DEC20",null,null,null,null,null,null,"X","PAXULD"]
[562,"Lufthansa","LH595","ABV",{"$f":"_xlfn.XLOOKUP(' Flight data base'!D563,'airport codes'!$D$3:$D$2103,'airport codes'!$C$3:$C$2103)","v":"Nigeria"},"FRA",{"$f":"_xlfn.XLOOKUP(' Flight data base'!F563,'airport codes'!$D$3:$D$2103,'airport codes'!$C$3:$C$2103)","v":"Germany"},"27DEC20",2310,530,"27DEC20",null,null,null,null,null,null,"X","PAXULD"]
[563,"Lufthansa","LH595","PHC",{"$f":"_xlfn.XLOOKUP(' Flight data base'!D564,'airport codes'!$D$3:$D$2103,'airport codes'!$C$3:$C$2103)","v":"Nigeria"},"FRA",{"$f":"_xlfn.XLOOKUP(' Flight data base'!F564,'airport codes'!$D$3:$D$2103,'airport codes'!$C$3:$C$2103)","v":"Germany"},"30DEC20",2040,530,"30DEC20",null,null,"X",null,null,null,null,"PAXULD"]
[564,"Lufthansa","LH595","PHC",{"$f":"_xlfn.XLOOKUP(' Flight data base'!D565,'airport codes'!$D$3:$D$2103,'airport codes'!$C$3:$C$2103)","v":"Nigeria"},"ABV",{"$f":"_xlfn.XLOOKUP(' Flight data base'!F565,'airport codes'!$D$3:$D$2103,'airport codes'!$C$3:$C$2103)","v":"Nigeria"},"30DEC20",2040,2150,"30DEC20",null,null,"X",null,null,null,null,"PAXULD"]
[565,"Lufthansa","LH595","ABV",{"$f":"_xlfn.XLOOKUP(' Flight data base'!D566,'airport codes'!$D$3:$D$2103,'airport codes'!$C$3:$C$2103)","v":"Nigeria"},"FRA",{"$f":"_xlfn.XLOOKUP(' Flight data base'!F566,'airport codes'!$D$3:$D$2103,'airport codes'!$C$3:$C$2103)","v":"Germany"},"30DEC20",2310,530,"30DEC20",null,null,"X",null,null,null,null,"PAXULD"]
[566,"Lufthansa","LH595","PHC",{"$f":"_xlfn.XLOOKUP(' Flight data base'!D567,'airport codes'!$D$3:$D$2103,'airport codes'!$C$3:$C$2103)","v":"Nigeria"},"FRA",{"$f":"_xlfn.XLOOKUP(' Flight data base'!F567,'airport codes'!$D$3:$D$2103,'airport codes'!$C$3:$C$2103)","v":"Germany"},"2021-01-03",2040,530,"2021-01-06",null,null,"X",null,null,null,"X","PAXULD"]
[567,"Lufthansa","LH595","PHC",{"$f":"_xlfn.XLOOKUP(' Flight data base'!D568,'airport codes'!$D$3:$D$2103,'airport codes'!$C$3:$C$2103)","v":"Nigeria"},"ABV",{"$f":"_xlfn.XLOOKUP(' Flight data base'!F568,'airport codes'!$D$3:$D$2103,'airport codes'!$C$3:$C$2103)","v":"Nigeria"},"2021-01-03",2040,2150,"2021-01-06",null,null,"X",null,null,null,"X","PAXULD"]
[568,"Lufthansa","LH595","ABV",{"$f":"_xlfn.XLOOKUP(' Flight data base'!D569,'airport codes'!$D$3:$D$2103,'airport codes'!$C$3:$C$2103)","v":"Nigeria"},"FRA",{"$f":"_xlfn.XLOOKUP(' Flight data base'!F569,'airport codes'!$D$3:$D$2103,'airport codes'!$C$3:$C$2103)","v":"Germany"},"2021-01-03",2310,530,"2021-01-06",null,null,"X",null,null,null,"X","PAXULD"]
[569,"Lufthansa","LH595","PHC",{"$f":"_xlfn.XLOOKUP(' Flight data base'!D570,'airport codes'!$D$3:$D$2103,'airport codes'!$C$3:$C$2103)","v":"Nigeria"},"FRA",{"$f":"_xlfn.XLOOKUP(' Flight data base'!F570,'airport codes'!$D$3:$D$2103,'airport codes'!$C$3:$C$2103)","v":"Germany"},"2021-01-08",2040,530,"26FEB21",null,null,null,null,"X",null,null,"PAXULD"]
[570,"Lufthansa","LH595","PHC",{"$f":"_xlfn.XLOOKUP(' Flight data base'!D571,'airport codes'!$D$3:$D$2103,'airport codes'!$C$3:$C$2103)","v":"Nigeria"},"ABV",{"$f":"_xlfn.XLOOKUP(' Flight data base'!F571,'airport codes'!$D$3:$D$2103,'airport codes'!$C$3:$C$2103)","v":"Nigeria"},"2021-01-08",2040,2150,"26FEB21",null,null,null,null,"X",null,null,"PAXULD"]
[571,"Lufthansa","LH595","ABV",{"$f":"_xlfn.XLOOKUP(' Flight data base'!D572,'airport codes'!$D$3:$D$2103,'airport codes'!$C$3:$C$2103)","v":"Nigeria"},"FRA",{"$f":"_xlfn.XLOOKUP(' Flight data base'!F572,'airport codes'!$D$3:$D$2103,'airport codes'!$C$3:$C$2103)","v":"Germany"},"2021-01-08",2310,530,"26FEB21",null,null,null,null,"X",null,null,"PAXULD"]
[572,"Lufthansa","LH595","PHC",{"$f":"_xlfn.XLOOKUP(' Flight data base'!D573,'airport codes'!$D$3:$D$2103,'airport codes'!$C$3:$C$2103)","v":"Nigeria"},"FRA",{"$f":"_xlfn.XLOOKUP(' Flight data base'!F573,'airport codes'!$D$3:$D$2103,'airport codes'!$C$3:$C$2103)","v":"Germany"},"28DEC20",2040,530,"2021-01-11","X",null,null,null,null,null,null,"PAXULD"]
[573,"Lufthansa","LH595","PHC",{"$f":"_xlfn.XLOOKUP(' Flight data base'!D574,'airport codes'!$D$3:$D$2103,'airport codes'!$C$3:$C$2103)","v":"Nigeria"},"ABV",{"$f":"_xlfn.XLOOKUP(' Flight data base'!F574,'airport codes'!$D$3:$D$2103,'airport codes'!$C$3:$C$2103)","v":"Nigeria"},"28DEC20",2040,2150,"2021-01-11","X",null,null,null,null,null,null,"PAXULD"]
[574,"Lufthansa","LH595","ABV",{"$f":"_xlfn.XLOOKUP(' Flight data base'!D575,'airport codes'!$D$3:$D$2103,'airport codes'!$C$3:$C$2103)","v":"Nigeria"},"FRA",{"$f":"_xlfn.XLOOKUP(' Flight data base'!F575,'airport codes'!$D$3:$D$2103,'airport codes'!$C$3:$C$2103)","v":"Germany"},"28DEC20",2310,530,"2021-01-11","X",null,null,null,null,null,null,"PAXULD"]
[575,"Lufthansa","LH595","PHC",{"$f":"_xlfn.XLOOKUP(' Flight data base'!D576,'airport codes'!$D$3:$D$2103,'airport codes'!$C$3:$C$2103)","v":"Nigeria"},"FRA",{"$f":"_xlfn.XLOOKUP(' Flight data base'!F576,'airport codes'!$D$3:$D$2103,'airport codes'!$C$3:$C$2103)","v":"Germany"},"2021-01-10",2040,530,"2021-01-17",null,null,"X",null,null,null,"X","PAXULD"]
[576,"Lufthansa","LH595","PHC",{"$f":"_xlfn.XLOOKUP(' Flight data base'!D577,'airport codes'!$D$3:$D$2103,'airport codes'!$C$3:$C$2103)","v":"Nigeria"},"ABV",{"$f":"_xlfn.XLOOKUP(' Flight data base'!F577,'airport codes'!$D$3:$D$2103,'airport codes'!$C$3:$C$2103)","v":"Nigeria"},"2021-01-10",2040,2150,"2021-01-17",null,null,"X",null,null,null,"X","PAXULD"]
[577,"Lufthansa","LH595","ABV",{"$f":"_xlfn.XLOOKUP(' Flight data base'!D578,'airport codes'!$D$3:$D$2103,'airport codes'!$C$3:$C$2103)","v":"Nigeria"},"FRA",{"$f":"_xlfn.XLOOKUP(' Flight data base'!F578,'airport codes'!$D$3:$D$2103,'airport codes'!$C$3:$C$2103)","v":"Germany"},"2021-01-10",2310,530,"2021-01-17",null,null,"X",null,null,null,"X","PAXULD"]
[578,"Lufthansa","LH595","ABV",{"$f":"_xlfn.XLOOKUP(' Flight data base'!D579,'airport codes'!$D$3:$D$2103,'airport codes'!$C$3:$C$2103)","v":"Nigeria"},"FRA",{"$f":"_xlfn.XLOOKUP(' Flight data base'!F579,'airport codes'!$D$3:$D$2103,'airport codes'!$C$3:$C$2103)","v":"Germany"},"16DEC20",2310,530,"16DEC20",null,null,"X",null,null,null,null,"PAXULD"]
[579,"Lufthansa","LH595","ABV",{"$f":"_xlfn.XLOOKUP(' Flight data base'!D580,'airport codes'!$D$3:$D$2103,'airport codes'!$C$3:$C$2103)","v":"Nigeria"},"FRA",{"$f":"_xlfn.XLOOKUP(' Flight data base'!F580,'airport codes'!$D$3:$D$2103,'airport codes'!$C$3:$C$2103)","v":"Germany"},"18DEC20",2310,530,"18DEC20",null,null,null,null,"X",null,null,"PAXULD"]
[580,"Lufthansa","LH595","ABV",{"$f":"_xlfn.XLOOKUP(' Flight data base'!D581,'airport codes'!$D$3:$D$2103,'airport codes'!$C$3:$C$2103)","v":"Nigeria"},"FRA",{"$f":"_xlfn.XLOOKUP(' Flight data base'!F581,'airport codes'!$D$3:$D$2103,'airport codes'!$C$3:$C$2103)","v":"Germany"},"20DEC20",2310,530,"20DEC20",null,null,null,null,null,null,"X","PAXULD"]
[581,"Lufthansa","LH595","ABV",{"$f":"_xlfn.XLOOKUP(' Flight data base'!D582,'airport codes'!$D$3:$D$2103,'airport codes'!$C$3:$C$2103)","v":"Nigeria"},"FRA",{"$f":"_xlfn.XLOOKUP(' Flight data base'!F582,'airport codes'!$D$3:$D$2103,'airport codes'!$C$3:$C$2103)","v":"Germany"},"21DEC20",2310,530,"21DEC20","X",null,null,null,null,null,null,"PAXULD"]
[582,"Lufthansa","LH6550S","JNB",{"$f":"_xlfn.XLOOKUP(' Flight data base'!D583,'airport codes'!$D$3:$D$2103,'airport codes'!$C$3:$C$2103)","v":"South Africa"},"CPT",{"$f":"_xlfn.XLOOKUP(' Flight data base'!F583,'airport codes'!$D$3:$D$2103,'airport codes'!$C$3:$C$2103)","v":"South Africa"},"18DEC20",2100,2055,"18DEC20",null,null,null,null,"X",null,null,"Trucks"]
[583,"Lufthansa","LH6550S","JNB",{"$f":"_xlfn.XLOOKUP(' Flight data base'!D584,'airport codes'!$D$3:$D$2103,'airport codes'!$C$3:$C$2103)","v":"South Africa"},"CPT",{"$f":"_xlfn.XLOOKUP(' Flight data base'!F584,'airport codes'!$D$3:$D$2103,'airport codes'!$C$3:$C$2103)","v":"South Africa"},"2021-01-06",2100,2055,"2021-01-06",null,null,"X",null,null,null,null,"Trucks"]
[584,"Lufthansa","LH6550S","JNB",{"$f":"_xlfn.XLOOKUP(' Flight data base'!D585,'airport codes'!$D$3:$D$2103,'airport codes'!$C$3:$C$2103)","v":"South Africa"},"CPT",{"$f":"_xlfn.XLOOKUP(' Flight data base'!F585,'airport codes'!$D$3:$D$2103,'airport codes'!$C$3:$C$2103)","v":"South Africa"},"2021-01-08",2100,2055,"30DEC22","X",null,"X",null,"X",null,null,"Trucks"]
[585,"Lufthansa","LH6551S","CPT",{"$f":"_xlfn.XLOOKUP(' Flight data base'!D586,'airport codes'!$D$3:$D$2103,'airport codes'!$C$3:$C$2103)","v":"South Africa"},"JNB",{"$f":"_xlfn.XLOOKUP(' Flight data base'!F586,'airport codes'!$D$3:$D$2103,'airport codes'!$C$3:$C$2103)","v":"South Africa"},"18DEC20",1800,1755,"21DEC20","X",null,null,null,"X",null,null,"Trucks"]
[586,"Lufthansa","LH6551S","CPT",{"$f":"_xlfn.XLOOKUP(' Flight data base'!D587,'airport codes'!$D$3:$D$2103,'airport codes'!$C$3:$C$2103)","v":"South Africa"},"JNB",{"$f":"_xlfn.XLOOKUP(' Flight data base'!F587,'airport codes'!$D$3:$D$2103,'airport codes'!$C$3:$C$2103)","v":"South Africa"},"2021-01-06",1800,1755,"2021-01-06",null,null,"X",null,null,null,null,"Trucks"]
[587,"Lufthansa","LH6551S","CPT",{"$f":"_xlfn.XLOOKUP(' Flight data base'!D588,'airport codes'!$D$3:$D$2103,'airport codes'!$C$3:$C$2103)","v":"South Africa"},"JNB",{"$f":"_xlfn.XLOOKUP(' Flight data base'!F588,'airport codes'!$D$3:$D$2103,'airport codes'!$C$3:$C$2103)","v":"South Africa"},"2021-01-08",1800,1755,"30DEC22","X",null,"X",null,"X",null,null,"Trucks"]
[588,"Lufthansa","LH6557S","PLZ",{"$f":"_xlfn.XLOOKUP(' Flight data base'!D589,'airport codes'!$D$3:$D$2103,'airport codes'!$C$3:$C$2103)","v":"South Africa"},"CPT",{"$f":"_xlfn.XLOOKUP(' Flight data base'!F589,'airport codes'!$D$3:$D$2103,'airport codes'!$C$3:$C$2103)","v":"South Africa"},"2020-10-08",2000,1300,"17DEC20",null,"X",null,"X",null,null,null,"Trucks"]
[589,"Lufthansa","LH6557S","PLZ",{"$f":"_xlfn.XLOOKUP(' Flight data base'!D590,'airport codes'!$D$3:$D$2103,'airport codes'!$C$3:$C$2103)","v":"South Africa"},"CPT",{"$f":"_xlfn.XLOOKUP(' Flight data base'!F590,'airport codes'!$D$3:$D$2103,'airport codes'!$C$3:$C$2103)","v":"South Africa"},"2021-01-07",2000,1300,"29DEC22",null,"X",null,"X",null,null,null,"Trucks"]
[590,"Lufthansa","LH6560S","JNB",{"$f":"_xlfn.XLOOKUP(' Flight data base'!D591,'airport codes'!$D$3:$D$2103,'airport codes'!$C$3:$C$2103)","v":"South Africa"},"DUR",{"$f":"_xlfn.XLOOKUP(' Flight data base'!F591,'airport codes'!$D$3:$D$2103,'airport codes'!$C$3:$C$2103)","v":"South Africa"},"2021-01-06",2000,730,"30DEC22","X",null,"X",null,"X",null,null,"Trucks"]
[591,"Lufthansa","LH6560S","JNB",{"$f":"_xlfn.XLOOKUP(' Flight data base'!D592,'airport codes'!$D$3:$D$2103,'airport codes'!$C$3:$C$2103)","v":"South Africa"},"DUR",{"$f":"_xlfn.XLOOKUP(' Flight data base'!F592,'airport codes'!$D$3:$D$2103,'airport codes'!$C$3:$C$2103)","v":"South Africa"},"18DEC20",2000,730,"21DEC20","X",null,null,null,"X",null,null,"Trucks"]
[592,"Lufthansa","LH6561S","DUR",{"$f":"_xlfn.XLOOKUP(' Flight data base'!D593,'airport codes'!$D$3:$D$2103,'airport codes'!$C$3:$C$2103)","v":"South Africa"},"JNB",{"$f":"_xlfn.XLOOKUP(' Flight data base'!F593,'airport codes'!$D$3:$D$2103,'airport codes'!$C$3:$C$2103)","v":"South Africa"},"18DEC20",2000,930,"18DEC20",null,null,null,null,"X",null,null,"Trucks"]
[593,"Lufthansa","LH6561S","DUR",{"$f":"_xlfn.XLOOKUP(' Flight data base'!D594,'airport codes'!$D$3:$D$2103,'airport codes'!$C$3:$C$2103)","v":"South Africa"},"JNB",{"$f":"_xlfn.XLOOKUP(' Flight data base'!F594,'airport codes'!$D$3:$D$2103,'airport codes'!$C$3:$C$2103)","v":"South Africa"},"2021-01-06",2000,930,"2021-01-06",null,null,"X",null,null,null,null,"Trucks"]
[594,"Lufthansa","LH6561S","DUR",{"$f":"_xlfn.XLOOKUP(' Flight data base'!D595,'airport codes'!$D$3:$D$2103,'airport codes'!$C$3:$C$2103)","v":"South Africa"},"JNB",{"$f":"_xlfn.XLOOKUP(' Flight data base'!F595,'airport codes'!$D$3:$D$2103,'airport codes'!$C$3:$C$2103)","v":"South Africa"},"2021-01-08",2000,930,"30DEC22",null,null,"X",null,"X",null,null,"Trucks"]
[595,"Lufthansa","LH6561S","DUR",{"$f":"_xlfn.XLOOKUP(' Flight data base'!D596,'airport codes'!$D$3:$D$2103,'airport codes'!$C$3:$C$2103)","v":"South Africa"},"JNB",{"$f":"_xlfn.XLOOKUP(' Flight data base'!F596,'airport codes'!$D$3:$D$2103,'airport codes'!$C$3:$C$2103)","v":"South Africa"},"2021-01-11",2000,930,"26DEC22","X",null,null,null,null,null,null,"Trucks"]
[596,"Lufthansa","LH6564S","JNB",{"$f":"_xlfn.XLOOKUP(' Flight data base'!D597,'airport codes'!$D$3:$D$2103,'airport codes'!$C$3:$C$2103)","v":"South Africa"},"PLZ",{"$f":"_xlfn.XLOOKUP(' Flight data base'!F597,'airport codes'!$D$3:$D$2103,'airport codes'!$C$3:$C$2103)","v":"South Africa"},"18DEC20",2300,1530,"21DEC20","X",null,null,null,"X",null,null,"Trucks"]
[597,"Lufthansa","LH6564S","JNB",{"$f":"_xlfn.XLOOKUP(' Flight data base'!D598,'airport codes'!$D$3:$D$2103,'airport codes'!$C$3:$C$2103)","v":"South Africa"},"PLZ",{"$f":"_xlfn.XLOOKUP(' Flight data base'!F598,'airport codes'!$D$3:$D$2103,'airport codes'!$C$3:$C$2103)","v":"South Africa"},"2021-01-06",2300,1530,"30DEC22","X",null,"X",null,"X",null,null,"Trucks"]
[598,"Lufthansa","LH8254","DSS",{"$f":"_xlfn.XLOOKUP(' Flight data base'!D599,'airport codes'!$D$3:$D$2103,'airport codes'!$C$3:$C$2103)","v":"Senegal"},"VCP",{"$f":"_xlfn.XLOOKUP(' Flight data base'!F599,'airport codes'!$D$3:$D$2103,'airport codes'!$C$3:$C$2103)","v":"Brazil"},"18DEC20",50,435,"28DEC20","X",null,null,null,"X",null,null,"Freighter"]
[599,"Lufthansa","LH8254","DSS",{"$f":"_xlfn.XLOOKUP(' Flight data base'!D600,'airport codes'!$D$3:$D$2103,'airport codes'!$C$3:$C$2103)","v":"Senegal"},"CWB",{"$f":"_xlfn.XLOOKUP(' Flight data base'!F600,'airport codes'!$D$3:$D$2103,'airport codes'!$C$3:$C$2103)","v":"Brazil"},"18DEC20",50,700,"28DEC20","X",null,null,null,"X",null,null,"Freighter"]
[600,"Lufthansa","LH8255","DSS",{"$f":"_xlfn.XLOOKUP(' Flight data base'!D601,'airport codes'!$D$3:$D$2103,'airport codes'!$C$3:$C$2103)","v":"Senegal"},"FRA",{"$f":"_xlfn.XLOOKUP(' Flight data base'!F601,'airport codes'!$D$3:$D$2103,'airport codes'!$C$3:$C$2103)","v":"Germany"},"19DEC20",10,710,"19DEC20",null,null,null,null,null,"X",null,"Freighter"]
[601,"Lufthansa","LH8255","DSS",{"$f":"_xlfn.XLOOKUP(' Flight data base'!D602,'airport codes'!$D$3:$D$2103,'airport codes'!$C$3:$C$2103)","v":"Senegal"},"FRA",{"$f":"_xlfn.XLOOKUP(' Flight data base'!F602,'airport codes'!$D$3:$D$2103,'airport codes'!$C$3:$C$2103)","v":"Germany"},"22DEC20",10,710,"22DEC20",null,"X",null,null,null,null,null,"Freighter"]
[602,"Lufthansa","LH8255","DSS",{"$f":"_xlfn.XLOOKUP(' Flight data base'!D603,'airport codes'!$D$3:$D$2103,'airport codes'!$C$3:$C$2103)","v":"Senegal"},"FRA",{"$f":"_xlfn.XLOOKUP(' Flight data base'!F603,'airport codes'!$D$3:$D$2103,'airport codes'!$C$3:$C$2103)","v":"Germany"},"26DEC20",10,710,"26DEC20",null,null,null,null,null,"X",null,"Freighter"]
[603,"Lufthansa","LH8255","DSS",{"$f":"_xlfn.XLOOKUP(' Flight data base'!D604,'airport codes'!$D$3:$D$2103,'airport codes'!$C$3:$C$2103)","v":"Senegal"},"FRA",{"$f":"_xlfn.XLOOKUP(' Flight data base'!F604,'airport codes'!$D$3:$D$2103,'airport codes'!$C$3:$C$2103)","v":"Germany"},"29DEC20",10,710,"29DEC20",null,"X",null,null,null,null,null,"Freighter"]
[604,"Lufthansa","LH8255","DSS",{"$f":"_xlfn.XLOOKUP(' Flight data base'!D605,'airport codes'!$D$3:$D$2103,'airport codes'!$C$3:$C$2103)","v":"Senegal"},"FRA",{"$f":"_xlfn.XLOOKUP(' Flight data base'!F605,'airport codes'!$D$3:$D$2103,'airport codes'!$C$3:$C$2103)","v":"Germany"},"15DEC20",10,710,"15DEC20",null,"X",null,null,null,null,null,"Freighter"]
[605,"Lufthansa","LH8264","DSS",{"$f":"_xlfn.XLOOKUP(' Flight data base'!D606,'airport codes'!$D$3:$D$2103,'airport codes'!$C$3:$C$2103)","v":"Senegal"},"VCP",{"$f":"_xlfn.XLOOKUP(' Flight data base'!F606,'airport codes'!$D$3:$D$2103,'airport codes'!$C$3:$C$2103)","v":"Brazil"},"20DEC20",600,945,"20DEC20",null,null,null,null,null,null,"X","Freighter"]
[606,"Lufthansa","LH8264","DSS",{"$f":"_xlfn.XLOOKUP(' Flight data base'!D607,'airport codes'!$D$3:$D$2103,'airport codes'!$C$3:$C$2103)","v":"Senegal"},"EZE",{"$f":"_xlfn.XLOOKUP(' Flight data base'!F607,'airport codes'!$D$3:$D$2103,'airport codes'!$C$3:$C$2103)","v":"Argentina"},"20DEC20",600,1435,"20DEC20",null,null,null,null,null,null,"X","Freighter"]
[607,"Lufthansa","LH8264","DSS",{"$f":"_xlfn.XLOOKUP(' Flight data base'!D608,'airport codes'!$D$3:$D$2103,'airport codes'!$C$3:$C$2103)","v":"Senegal"},"MVD",{"$f":"_xlfn.XLOOKUP(' Flight data base'!F608,'airport codes'!$D$3:$D$2103,'airport codes'!$C$3:$C$2103)","v":"Uruguay"},"20DEC20",600,1645,"20DEC20",null,null,null,null,null,null,"X","Freighter"]
[608,"Lufthansa","LH8264","DSS",{"$f":"_xlfn.XLOOKUP(' Flight data base'!D609,'airport codes'!$D$3:$D$2103,'airport codes'!$C$3:$C$2103)","v":"Senegal"},"VCP",{"$f":"_xlfn.XLOOKUP(' Flight data base'!F609,'airport codes'!$D$3:$D$2103,'airport codes'!$C$3:$C$2103)","v":"Brazil"},"23DEC20",600,945,"23DEC20",null,null,"X",null,null,null,null,"Freighter"]
[609,"Lufthansa","LH8264","DSS",{"$f":"_xlfn.XLOOKUP(' Flight data base'!D610,'airport codes'!$D$3:$D$2103,'airport codes'!$C$3:$C$2103)","v":"Senegal"},"EZE",{"$f":"_xlfn.XLOOKUP(' Flight data base'!F610,'airport codes'!$D$3:$D$2103,'airport codes'!$C$3:$C$2103)","v":"Argentina"},"23DEC20",600,1435,"23DEC20",null,null,"X",null,null,null,null,"Freighter"]
[610,"Lufthansa","LH8264","DSS",{"$f":"_xlfn.XLOOKUP(' Flight data base'!D611,'airport codes'!$D$3:$D$2103,'airport codes'!$C$3:$C$2103)","v":"Senegal"},"MVD",{"$f":"_xlfn.XLOOKUP(' Flight data base'!F611,'airport codes'!$D$3:$D$2103,'airport codes'!$C$3:$C$2103)","v":"Uruguay"},"23DEC20",600,1645,"23DEC20",null,null,"X",null,null,null,null,"Freighter"]
[611,"Lufthansa","LH8264","DSS",{"$f":"_xlfn.XLOOKUP(' Flight data base'!D612,'airport codes'!$D$3:$D$2103,'airport codes'!$C$3:$C$2103)","v":"Senegal"},"VCP",{"$f":"_xlfn.XLOOKUP(' Flight data base'!F612,'airport codes'!$D$3:$D$2103,'airport codes'!$C$3:$C$2103)","v":"Brazil"},"27DEC20",600,945,"27DEC20",null,null,null,null,null,null,"X","Freighter"]
[612,"Lufthansa","LH8264","DSS",{"$f":"_xlfn.XLOOKUP(' Flight data base'!D613,'airport codes'!$D$3:$D$2103,'airport codes'!$C$3:$C$2103)","v":"Senegal"},"MVD",{"$f":"_xlfn.XLOOKUP(' Flight data base'!F613,'airport codes'!$D$3:$D$2103,'airport codes'!$C$3:$C$2103)","v":"Uruguay"},"27DEC20",600,1645,"27DEC20",null,null,null,null,null,null,"X","Freighter"]
[613,"Lufthansa","LH8264","DSS",{"$f":"_xlfn.XLOOKUP(' Flight data base'!D614,'airport codes'!$D$3:$D$2103,'airport codes'!$C$3:$C$2103)","v":"Senegal"},"EZE",{"$f":"_xlfn.XLOOKUP(' Flight data base'!F614,'airport codes'!$D$3:$D$2103,'airport codes'!$C$3:$C$2103)","v":"Argentina"},"27DEC20",600,1435,"27DEC20",null,null,null,null,null,null,"X","Freighter"]
[614,"Lufthansa","LH8264","DSS",{"$f":"_xlfn.XLOOKUP(' Flight data base'!D615,'airport codes'!$D$3:$D$2103,'airport codes'!$C$3:$C$2103)","v":"Senegal"},"VCP",{"$f":"_xlfn.XLOOKUP(' Flight data base'!F615,'airport codes'!$D$3:$D$2103,'airport codes'!$C$3:$C$2103)","v":"Brazil"},"30DEC20",600,945,"30DEC20",null,null,"X",null,null,null,null,"Freighter"]
[615,"Lufthansa","LH8264","DSS",{"$f":"_xlfn.XLOOKUP(' Flight data base'!D616,'airport codes'!$D$3:$D$2103,'airport codes'!$C$3:$C$2103)","v":"Senegal"},"EZE",{"$f":"_xlfn.XLOOKUP(' Flight data base'!F616,'airport codes'!$D$3:$D$2103,'airport codes'!$C$3:$C$2103)","v":"Argentina"},"30DEC20",600,1435,"30DEC20",null,null,"X",null,null,null,null,"Freighter"]
[616,"Lufthansa","LH8264","DSS",{"$f":"_xlfn.XLOOKUP(' Flight data base'!D617,'airport codes'!$D$3:$D$2103,'airport codes'!$C$3:$C$2103)","v":"Senegal"},"MVD",{"$f":"_xlfn.XLOOKUP(' Flight data base'!F617,'airport codes'!$D$3:$D$2103,'airport codes'!$C$3:$C$2103)","v":"Uruguay"},"30DEC20",600,1645,"30DEC20",null,null,"X",null,null,null,null,"Freighter"]
[617,"Lufthansa","LH8264","DSS",{"$f":"_xlfn.XLOOKUP(' Flight data base'!D618,'airport codes'!$D$3:$D$2103,'airport codes'!$C$3:$C$2103)","v":"Senegal"},"VCP",{"$f":"_xlfn.XLOOKUP(' Flight data base'!F618,'airport codes'!$D$3:$D$2103,'airport codes'!$C$3:$C$2103)","v":"Brazil"},"16DEC20",600,945,"16DEC20",null,null,"X",null,null,null,null,"Freighter"]
[618,"Lufthansa","LH8264","DSS",{"$f":"_xlfn.XLOOKUP(' Flight data base'!D619,'airport codes'!$D$3:$D$2103,'airport codes'!$C$3:$C$2103)","v":"Senegal"},"MVD",{"$f":"_xlfn.XLOOKUP(' Flight data base'!F619,'airport codes'!$D$3:$D$2103,'airport codes'!$C$3:$C$2103)","v":"Uruguay"},"16DEC20",600,1645,"16DEC20",null,null,"X",null,null,null,null,"Freighter"]
[619,"Lufthansa","LH8264","DSS",{"$f":"_xlfn.XLOOKUP(' Flight data base'!D620,'airport codes'!$D$3:$D$2103,'airport codes'!$C$3:$C$2103)","v":"Senegal"},"EZE",{"$f":"_xlfn.XLOOKUP(' Flight data base'!F620,'airport codes'!$D$3:$D$2103,'airport codes'!$C$3:$C$2103)","v":"Argentina"},"16DEC20",600,1435,"16DEC20",null,null,"X",null,null,null,null,"Freighter"]
[620,"Lufthansa","LH8265","DSS",{"$f":"_xlfn.XLOOKUP(' Flight data base'!D621,'airport codes'!$D$3:$D$2103,'airport codes'!$C$3:$C$2103)","v":"Senegal"},"FRA",{"$f":"_xlfn.XLOOKUP(' Flight data base'!F621,'airport codes'!$D$3:$D$2103,'airport codes'!$C$3:$C$2103)","v":"Germany"},"21DEC20",910,1610,"21DEC20","X",null,null,null,null,null,null,"Freighter"]
[621,"Lufthansa","LH8265","DSS",{"$f":"_xlfn.XLOOKUP(' Flight data base'!D622,'airport codes'!$D$3:$D$2103,'airport codes'!$C$3:$C$2103)","v":"Senegal"},"FRA",{"$f":"_xlfn.XLOOKUP(' Flight data base'!F622,'airport codes'!$D$3:$D$2103,'airport codes'!$C$3:$C$2103)","v":"Germany"},"24DEC20",910,1610,"24DEC20",null,null,null,"X",null,null,null,"Freighter"]
[622,"Lufthansa","LH8265","DSS",{"$f":"_xlfn.XLOOKUP(' Flight data base'!D623,'airport codes'!$D$3:$D$2103,'airport codes'!$C$3:$C$2103)","v":"Senegal"},"FRA",{"$f":"_xlfn.XLOOKUP(' Flight data base'!F623,'airport codes'!$D$3:$D$2103,'airport codes'!$C$3:$C$2103)","v":"Germany"},"28DEC20",910,1610,"28DEC20","X",null,null,null,null,null,null,"Freighter"]
[623,"Lufthansa","LH8265","DSS",{"$f":"_xlfn.XLOOKUP(' Flight data base'!D624,'airport codes'!$D$3:$D$2103,'airport codes'!$C$3:$C$2103)","v":"Senegal"},"FRA",{"$f":"_xlfn.XLOOKUP(' Flight data base'!F624,'airport codes'!$D$3:$D$2103,'airport codes'!$C$3:$C$2103)","v":"Germany"},"31DEC20",910,1610,"31DEC20",null,null,null,"X",null,null,null,"Freighter"]
[624,"Lufthansa","LH8266","DSS",{"$f":"_xlfn.XLOOKUP(' Flight data base'!D625,'airport codes'!$D$3:$D$2103,'airport codes'!$C$3:$C$2103)","v":"Senegal"},"GRU",{"$f":"_xlfn.XLOOKUP(' Flight data base'!F625,'airport codes'!$D$3:$D$2103,'airport codes'!$C$3:$C$2103)","v":"Brazil"},"22DEC20",2110,100,"29DEC20",null,"X",null,null,null,null,null,"Freighter"]
[625,"Lufthansa","LH8266","DSS",{"$f":"_xlfn.XLOOKUP(' Flight data base'!D626,'airport codes'!$D$3:$D$2103,'airport codes'!$C$3:$C$2103)","v":"Senegal"},"EZE",{"$f":"_xlfn.XLOOKUP(' Flight data base'!F626,'airport codes'!$D$3:$D$2103,'airport codes'!$C$3:$C$2103)","v":"Argentina"},"22DEC20",2110,555,"29DEC20",null,"X",null,null,null,null,null,"Freighter"]
[626,"Lufthansa","LH8266","DSS",{"$f":"_xlfn.XLOOKUP(' Flight data base'!D627,'airport codes'!$D$3:$D$2103,'airport codes'!$C$3:$C$2103)","v":"Senegal"},"VCP",{"$f":"_xlfn.XLOOKUP(' Flight data base'!F627,'airport codes'!$D$3:$D$2103,'airport codes'!$C$3:$C$2103)","v":"Brazil"},"22DEC20",2110,1045,"29DEC20",null,"X",null,null,null,null,null,"Freighter"]
[627,"Lufthansa","LH8266","DSS",{"$f":"_xlfn.XLOOKUP(' Flight data base'!D628,'airport codes'!$D$3:$D$2103,'airport codes'!$C$3:$C$2103)","v":"Senegal"},"GRU",{"$f":"_xlfn.XLOOKUP(' Flight data base'!F628,'airport codes'!$D$3:$D$2103,'airport codes'!$C$3:$C$2103)","v":"Brazil"},"15DEC20",2110,100,"15DEC20",null,"X",null,null,null,null,null,"Freighter"]
[628,"Lufthansa","LH8266","DSS",{"$f":"_xlfn.XLOOKUP(' Flight data base'!D629,'airport codes'!$D$3:$D$2103,'airport codes'!$C$3:$C$2103)","v":"Senegal"},"EZE",{"$f":"_xlfn.XLOOKUP(' Flight data base'!F629,'airport codes'!$D$3:$D$2103,'airport codes'!$C$3:$C$2103)","v":"Argentina"},"15DEC20",2110,555,"15DEC20",null,"X",null,null,null,null,null,"Freighter"]
[629,"Lufthansa","LH8266","DSS",{"$f":"_xlfn.XLOOKUP(' Flight data base'!D630,'airport codes'!$D$3:$D$2103,'airport codes'!$C$3:$C$2103)","v":"Senegal"},"VCP",{"$f":"_xlfn.XLOOKUP(' Flight data base'!F630,'airport codes'!$D$3:$D$2103,'airport codes'!$C$3:$C$2103)","v":"Brazil"},"15DEC20",2110,1045,"15DEC20",null,"X",null,null,null,null,null,"Freighter"]
[630,"Lufthansa","LH8267","DSS",{"$f":"_xlfn.XLOOKUP(' Flight data base'!D631,'airport codes'!$D$3:$D$2103,'airport codes'!$C$3:$C$2103)","v":"Senegal"},"FRA",{"$f":"_xlfn.XLOOKUP(' Flight data base'!F631,'airport codes'!$D$3:$D$2103,'airport codes'!$C$3:$C$2103)","v":"Germany"},"23DEC20",2340,640,"23DEC20",null,null,"X",null,null,null,null,"Freighter"]
[631,"Lufthansa","LH8267","DSS",{"$f":"_xlfn.XLOOKUP(' Flight data base'!D632,'airport codes'!$D$3:$D$2103,'airport codes'!$C$3:$C$2103)","v":"Senegal"},"FRA",{"$f":"_xlfn.XLOOKUP(' Flight data base'!F632,'airport codes'!$D$3:$D$2103,'airport codes'!$C$3:$C$2103)","v":"Germany"},"30DEC20",2340,640,"30DEC20",null,null,"X",null,null,null,null,"Freighter"]
[632,"Lufthansa","LH8267","DSS",{"$f":"_xlfn.XLOOKUP(' Flight data base'!D633,'airport codes'!$D$3:$D$2103,'airport codes'!$C$3:$C$2103)","v":"Senegal"},"FRA",{"$f":"_xlfn.XLOOKUP(' Flight data base'!F633,'airport codes'!$D$3:$D$2103,'airport codes'!$C$3:$C$2103)","v":"Germany"},"16DEC20",2340,640,"16DEC20",null,null,"X",null,null,null,null,"Freighter"]
[633,"Lufthansa","LH8291","CAI",{"$f":"_xlfn.XLOOKUP(' Flight data base'!D634,'airport codes'!$D$3:$D$2103,'airport codes'!$C$3:$C$2103)","v":"Egypt"},"FRA",{"$f":"_xlfn.XLOOKUP(' Flight data base'!F634,'airport codes'!$D$3:$D$2103,'airport codes'!$C$3:$C$2103)","v":"Germany"},"21DEC20",450,810,"21DEC20","X",null,null,null,null,null,null,"Freighter"]
[634,"Lufthansa","LH8291","CAI",{"$f":"_xlfn.XLOOKUP(' Flight data base'!D635,'airport codes'!$D$3:$D$2103,'airport codes'!$C$3:$C$2103)","v":"Egypt"},"FRA",{"$f":"_xlfn.XLOOKUP(' Flight data base'!F635,'airport codes'!$D$3:$D$2103,'airport codes'!$C$3:$C$2103)","v":"Germany"},"28DEC20",450,810,"28DEC20","X",null,null,null,null,null,null,"Freighter"]
[635,"Lufthansa","LH8291","CAI",{"$f":"_xlfn.XLOOKUP(' Flight data base'!D636,'airport codes'!$D$3:$D$2103,'airport codes'!$C$3:$C$2103)","v":"Egypt"},"FRA",{"$f":"_xlfn.XLOOKUP(' Flight data base'!F636,'airport codes'!$D$3:$D$2103,'airport codes'!$C$3:$C$2103)","v":"Germany"},"30DEC20",450,810,"30DEC20",null,null,"X",null,null,null,null,"Freighter"]
[636,"Lufthansa","LH8291","CAI",{"$f":"_xlfn.XLOOKUP(' Flight data base'!D637,'airport codes'!$D$3:$D$2103,'airport codes'!$C$3:$C$2103)","v":"Egypt"},"FRA",{"$f":"_xlfn.XLOOKUP(' Flight data base'!F637,'airport codes'!$D$3:$D$2103,'airport codes'!$C$3:$C$2103)","v":"Germany"},"17DEC20",450,810,"17DEC20",null,null,null,"X",null,null,null,"Freighter"]
[637,"Lufthansa","LH8291","CAI",{"$f":"_xlfn.XLOOKUP(' Flight data base'!D638,'airport codes'!$D$3:$D$2103,'airport codes'!$C$3:$C$2103)","v":"Egypt"},"FRA",{"$f":"_xlfn.XLOOKUP(' Flight data base'!F638,'airport codes'!$D$3:$D$2103,'airport codes'!$C$3:$C$2103)","v":"Germany"},"22DEC20",1635,1955,"22DEC20",null,"X",null,null,null,null,null,"Freighter"]
[638,"Lufthansa","LH8291","CAI",{"$f":"_xlfn.XLOOKUP(' Flight data base'!D639,'airport codes'!$D$3:$D$2103,'airport codes'!$C$3:$C$2103)","v":"Egypt"},"FRA",{"$f":"_xlfn.XLOOKUP(' Flight data base'!F639,'airport codes'!$D$3:$D$2103,'airport codes'!$C$3:$C$2103)","v":"Germany"},"2021-01-03",450,810,"2021-03-25","X",null,"X","X",null,null,"X","Freighter"]
[639,"Lufthansa","LH8291","CAI",{"$f":"_xlfn.XLOOKUP(' Flight data base'!D640,'airport codes'!$D$3:$D$2103,'airport codes'!$C$3:$C$2103)","v":"Egypt"},"FRA",{"$f":"_xlfn.XLOOKUP(' Flight data base'!F640,'airport codes'!$D$3:$D$2103,'airport codes'!$C$3:$C$2103)","v":"Germany"},"16DEC20",450,810,"16DEC20",null,null,"X",null,null,null,null,"Freighter"]
[640,"Lufthansa","LH8293","CAI",{"$f":"_xlfn.XLOOKUP(' Flight data base'!D641,'airport codes'!$D$3:$D$2103,'airport codes'!$C$3:$C$2103)","v":"Egypt"},"FRA",{"$f":"_xlfn.XLOOKUP(' Flight data base'!F641,'airport codes'!$D$3:$D$2103,'airport codes'!$C$3:$C$2103)","v":"Germany"},"23DEC20",1415,1735,"23DEC20",null,null,"X",null,null,null,null,"Freighter"]
[641,"Lufthansa","LH8295","CAI",{"$f":"_xlfn.XLOOKUP(' Flight data base'!D642,'airport codes'!$D$3:$D$2103,'airport codes'!$C$3:$C$2103)","v":"Egypt"},"FRA",{"$f":"_xlfn.XLOOKUP(' Flight data base'!F642,'airport codes'!$D$3:$D$2103,'airport codes'!$C$3:$C$2103)","v":"Germany"},"25DEC20",1415,1725,"25DEC20",null,null,null,null,"X",null,null,"Freighter"]
[642,"Lufthansa","LH8295","CAI",{"$f":"_xlfn.XLOOKUP(' Flight data base'!D643,'airport codes'!$D$3:$D$2103,'airport codes'!$C$3:$C$2103)","v":"Egypt"},"FRA",{"$f":"_xlfn.XLOOKUP(' Flight data base'!F643,'airport codes'!$D$3:$D$2103,'airport codes'!$C$3:$C$2103)","v":"Germany"},"29DEC20",1415,1725,"29DEC20",null,"X",null,null,null,null,null,"Freighter"]
[643,"Lufthansa","LH8295","CAI",{"$f":"_xlfn.XLOOKUP(' Flight data base'!D644,'airport codes'!$D$3:$D$2103,'airport codes'!$C$3:$C$2103)","v":"Egypt"},"FRA",{"$f":"_xlfn.XLOOKUP(' Flight data base'!F644,'airport codes'!$D$3:$D$2103,'airport codes'!$C$3:$C$2103)","v":"Germany"},"2021-01-01",1415,1725,"2021-01-01",null,null,null,null,"X",null,null,"Freighter"]
[644,"Lufthansa","LH8295","CAI",{"$f":"_xlfn.XLOOKUP(' Flight data base'!D645,'airport codes'!$D$3:$D$2103,'airport codes'!$C$3:$C$2103)","v":"Egypt"},"FRA",{"$f":"_xlfn.XLOOKUP(' Flight data base'!F645,'airport codes'!$D$3:$D$2103,'airport codes'!$C$3:$C$2103)","v":"Germany"},"2021-01-05",1415,1725,"2021-01-26",null,"X",null,null,null,null,null,"Freighter"]
[645,"Lufthansa","LH8295","CAI",{"$f":"_xlfn.XLOOKUP(' Flight data base'!D646,'airport codes'!$D$3:$D$2103,'airport codes'!$C$3:$C$2103)","v":"Egypt"},"FRA",{"$f":"_xlfn.XLOOKUP(' Flight data base'!F646,'airport codes'!$D$3:$D$2103,'airport codes'!$C$3:$C$2103)","v":"Germany"},"17DEC20",1415,1725,"17DEC20",null,null,null,"X",null,null,null,"Freighter"]
[646,"Lufthansa","LH8295","CAI",{"$f":"_xlfn.XLOOKUP(' Flight data base'!D647,'airport codes'!$D$3:$D$2103,'airport codes'!$C$3:$C$2103)","v":"Egypt"},"FRA",{"$f":"_xlfn.XLOOKUP(' Flight data base'!F647,'airport codes'!$D$3:$D$2103,'airport codes'!$C$3:$C$2103)","v":"Germany"},"20DEC20",1415,1725,"22DEC20",null,"X",null,null,null,null,"X","Freighter"]
[647,"Lufthansa","LH891","SAZ",{"$f":"_xlfn.XLOOKUP(' Flight data base'!D648,'airport codes'!$D$3:$D$2103,'airport codes'!$C$3:$C$2103)","v":{"$error":"#N/A"}},"FRA",{"$f":"_xlfn.XLOOKUP(' Flight data base'!F648,'airport codes'!$D$3:$D$2103,'airport codes'!$C$3:$C$2103)","v":"Germany"},"19DEC20",1400,1520,"19DEC20",null,null,null,null,null,"X",null,"Others"]
[648,"Lufthansa","LH891","SAZ",{"$f":"_xlfn.XLOOKUP(' Flight data base'!D649,'airport codes'!$D$3:$D$2103,'airport codes'!$C$3:$C$2103)","v":{"$error":"#N/A"}},"FRA",{"$f":"_xlfn.XLOOKUP(' Flight data base'!F649,'airport codes'!$D$3:$D$2103,'airport codes'!$C$3:$C$2103)","v":"Germany"},"18DEC20",1400,1520,"18DEC20",null,null,null,null,"X",null,null,"Others"]
[649,"Lufthansa","LH891","SAZ",{"$f":"_xlfn.XLOOKUP(' Flight data base'!D650,'airport codes'!$D$3:$D$2103,'airport codes'!$C$3:$C$2103)","v":{"$error":"#N/A"}},"FRA",{"$f":"_xlfn.XLOOKUP(' Flight data base'!F650,'airport codes'!$D$3:$D$2103,'airport codes'!$C$3:$C$2103)","v":"Germany"},"21DEC20",1400,1520,"21DEC20","X",null,null,null,null,null,null,"Others"]
[650,"Lufthansa","LH891","SAZ",{"$f":"_xlfn.XLOOKUP(' Flight data base'!D651,'airport codes'!$D$3:$D$2103,'airport codes'!$C$3:$C$2103)","v":{"$error":"#N/A"}},"FRA",{"$f":"_xlfn.XLOOKUP(' Flight data base'!F651,'airport codes'!$D$3:$D$2103,'airport codes'!$C$3:$C$2103)","v":"Germany"},"28DEC20",1400,1520,"28DEC20","X",null,null,null,null,null,null,"Others"]
[651,"Lufthansa","LH891","SAZ",{"$f":"_xlfn.XLOOKUP(' Flight data base'!D652,'airport codes'!$D$3:$D$2103,'airport codes'!$C$3:$C$2103)","v":{"$error":"#N/A"}},"FRA",{"$f":"_xlfn.XLOOKUP(' Flight data base'!F652,'airport codes'!$D$3:$D$2103,'airport codes'!$C$3:$C$2103)","v":"Germany"},"30DEC20",1400,1520,"30DEC20",null,null,"X",null,null,null,null,"Others"]
[652,"Lufthansa","LH891","SAZ",{"$f":"_xlfn.XLOOKUP(' Flight data base'!D653,'airport codes'!$D$3:$D$2103,'airport codes'!$C$3:$C$2103)","v":{"$error":"#N/A"}},"FRA",{"$f":"_xlfn.XLOOKUP(' Flight data base'!F653,'airport codes'!$D$3:$D$2103,'airport codes'!$C$3:$C$2103)","v":"Germany"},"2021-01-02",1400,1520,"2021-01-02",null,null,null,null,null,"X",null,"Others"]
[653,"Lufthansa","LH891","SAZ",{"$f":"_xlfn.XLOOKUP(' Flight data base'!D654,'airport codes'!$D$3:$D$2103,'airport codes'!$C$3:$C$2103)","v":{"$error":"#N/A"}},"FRA",{"$f":"_xlfn.XLOOKUP(' Flight data base'!F654,'airport codes'!$D$3:$D$2103,'airport codes'!$C$3:$C$2103)","v":"Germany"},"2021-01-04",1400,1520,"2021-01-04","X",null,null,null,null,null,null,"Others"]
[654,"Eurowings","EW1279","WDH",{"$f":"_xlfn.XLOOKUP(' Flight data base'!D655,'airport codes'!$D$3:$D$2103,'airport codes'!$C$3:$C$2103)","v":"Namibia"},"FRA",{"$f":"_xlfn.XLOOKUP(' Flight data base'!F655,'airport codes'!$D$3:$D$2103,'airport codes'!$C$3:$C$2103)","v":"Germany"},"2020-11-11",1000,1935,"2021-03-26",null,null,"X",null,"X",null,"X","PAXULD"]
[655,"Eurowings","EW1279","WDH",{"$f":"_xlfn.XLOOKUP(' Flight data base'!D656,'airport codes'!$D$3:$D$2103,'airport codes'!$C$3:$C$2103)","v":"Namibia"},"FRA",{"$f":"_xlfn.XLOOKUP(' Flight data base'!F656,'airport codes'!$D$3:$D$2103,'airport codes'!$C$3:$C$2103)","v":"Germany"},"2021-01-11",1000,1935,"2021-01-11","X",null,null,null,null,null,null,"PAXULD"]
[656,"Austrian Airlines","OS032","CPT",{"$f":"_xlfn.XLOOKUP(' Flight data base'!D657,'airport codes'!$D$3:$D$2103,'airport codes'!$C$3:$C$2103)","v":"South Africa"},"VIE",{"$f":"_xlfn.XLOOKUP(' Flight data base'!F657,'airport codes'!$D$3:$D$2103,'airport codes'!$C$3:$C$2103)","v":"Austria"},"20DEC20",20,1050,"2021-03-21",null,null,null,null,null,null,"X","PAXULD"]
[657,"Austrian Airlines","OS032","CPT",{"$f":"_xlfn.XLOOKUP(' Flight data base'!D658,'airport codes'!$D$3:$D$2103,'airport codes'!$C$3:$C$2103)","v":"South Africa"},"VIE",{"$f":"_xlfn.XLOOKUP(' Flight data base'!F658,'airport codes'!$D$3:$D$2103,'airport codes'!$C$3:$C$2103)","v":"Austria"},"23DEC20",1830,540,"2021-03-24",null,null,"X",null,null,null,null,"PAXULD"]
[658,"Austrian Airlines","OS032","CPT",{"$f":"_xlfn.XLOOKUP(' Flight data base'!D659,'airport codes'!$D$3:$D$2103,'airport codes'!$C$3:$C$2103)","v":"South Africa"},"VIE",{"$f":"_xlfn.XLOOKUP(' Flight data base'!F659,'airport codes'!$D$3:$D$2103,'airport codes'!$C$3:$C$2103)","v":"Austria"},"2021-01-02",1830,540,"2021-01-02",null,null,null,null,null,"X",null,"PAXULD"]
[659,"Austrian Airlines","OS032","CPT",{"$f":"_xlfn.XLOOKUP(' Flight data base'!D660,'airport codes'!$D$3:$D$2103,'airport codes'!$C$3:$C$2103)","v":"South Africa"},"VIE",{"$f":"_xlfn.XLOOKUP(' Flight data base'!F660,'airport codes'!$D$3:$D$2103,'airport codes'!$C$3:$C$2103)","v":"Austria"},"2021-01-05",2300,1010,"27FEB21",null,"X",null,null,null,"X",null,"PAXULD"]
[660,"Austrian Airlines","OS032","CPT",{"$f":"_xlfn.XLOOKUP(' Flight data base'!D661,'airport codes'!$D$3:$D$2103,'airport codes'!$C$3:$C$2103)","v":"South Africa"},"VIE",{"$f":"_xlfn.XLOOKUP(' Flight data base'!F661,'airport codes'!$D$3:$D$2103,'airport codes'!$C$3:$C$2103)","v":"Austria"},"19DEC20",2300,1010,"19DEC20",null,null,null,null,null,"X",null,"PAXULD"]
[661,"Austrian Airlines","OS032","CPT",{"$f":"_xlfn.XLOOKUP(' Flight data base'!D662,'airport codes'!$D$3:$D$2103,'airport codes'!$C$3:$C$2103)","v":"South Africa"},"VIE",{"$f":"_xlfn.XLOOKUP(' Flight data base'!F662,'airport codes'!$D$3:$D$2103,'airport codes'!$C$3:$C$2103)","v":"Austria"},"26DEC20",2300,1010,"29DEC20",null,"X",null,null,null,"X",null,"PAXULD"]
[662,"Austrian Airlines","OS032","CPT",{"$f":"_xlfn.XLOOKUP(' Flight data base'!D663,'airport codes'!$D$3:$D$2103,'airport codes'!$C$3:$C$2103)","v":"South Africa"},"VIE",{"$f":"_xlfn.XLOOKUP(' Flight data base'!F663,'airport codes'!$D$3:$D$2103,'airport codes'!$C$3:$C$2103)","v":"Austria"},"22DEC20",2300,1010,"22DEC20",null,"X",null,null,null,null,null,"PAXULD"]
[663,"Austrian Airlines","OS866","CAI",{"$f":"_xlfn.XLOOKUP(' Flight data base'!D664,'airport codes'!$D$3:$D$2103,'airport codes'!$C$3:$C$2103)","v":"Egypt"},"VIE",{"$f":"_xlfn.XLOOKUP(' Flight data base'!F664,'airport codes'!$D$3:$D$2103,'airport codes'!$C$3:$C$2103)","v":"Austria"},"16DEC20",1320,1600,"16DEC20",null,null,"X",null,null,null,null,"PAXULD"]
[664,"Austrian Airlines","OS866","CAI",{"$f":"_xlfn.XLOOKUP(' Flight data base'!D665,'airport codes'!$D$3:$D$2103,'airport codes'!$C$3:$C$2103)","v":"Egypt"},"VIE",{"$f":"_xlfn.XLOOKUP(' Flight data base'!F665,'airport codes'!$D$3:$D$2103,'airport codes'!$C$3:$C$2103)","v":"Austria"},"19DEC20",355,635,"21DEC20","X",null,null,null,null,"X",null,"PAXULD"]
[665,"Austrian Airlines","OS866","CAI",{"$f":"_xlfn.XLOOKUP(' Flight data base'!D666,'airport codes'!$D$3:$D$2103,'airport codes'!$C$3:$C$2103)","v":"Egypt"},"VIE",{"$f":"_xlfn.XLOOKUP(' Flight data base'!F666,'airport codes'!$D$3:$D$2103,'airport codes'!$C$3:$C$2103)","v":"Austria"},"20DEC20",1320,1600,"20DEC20",null,null,null,null,null,null,"X","PAXULD"]
[666,"Austrian Airlines","OS866","CAI",{"$f":"_xlfn.XLOOKUP(' Flight data base'!D667,'airport codes'!$D$3:$D$2103,'airport codes'!$C$3:$C$2103)","v":"Egypt"},"VIE",{"$f":"_xlfn.XLOOKUP(' Flight data base'!F667,'airport codes'!$D$3:$D$2103,'airport codes'!$C$3:$C$2103)","v":"Austria"},"23DEC20",1320,1600,"30DEC20",null,null,"X",null,null,null,null,"PAXULD"]
[667,"Austrian Airlines","OS866","CAI",{"$f":"_xlfn.XLOOKUP(' Flight data base'!D668,'airport codes'!$D$3:$D$2103,'airport codes'!$C$3:$C$2103)","v":"Egypt"},"VIE",{"$f":"_xlfn.XLOOKUP(' Flight data base'!F668,'airport codes'!$D$3:$D$2103,'airport codes'!$C$3:$C$2103)","v":"Austria"},"27DEC20",1320,1600,"27DEC20",null,null,null,null,null,null,"X","PAXULD"]
[668,"Austrian Airlines","OS866","CAI",{"$f":"_xlfn.XLOOKUP(' Flight data base'!D669,'airport codes'!$D$3:$D$2103,'airport codes'!$C$3:$C$2103)","v":"Egypt"},"VIE",{"$f":"_xlfn.XLOOKUP(' Flight data base'!F669,'airport codes'!$D$3:$D$2103,'airport codes'!$C$3:$C$2103)","v":"Austria"},"2021-01-01",320,600,"2021-01-01",null,null,null,null,"X",null,null,"PAXULD"]
[669,"Austrian Airlines","OS866","CAI",{"$f":"_xlfn.XLOOKUP(' Flight data base'!D670,'airport codes'!$D$3:$D$2103,'airport codes'!$C$3:$C$2103)","v":"Egypt"},"VIE",{"$f":"_xlfn.XLOOKUP(' Flight data base'!F670,'airport codes'!$D$3:$D$2103,'airport codes'!$C$3:$C$2103)","v":"Austria"},"2021-01-02",355,635,"2021-01-02",null,null,null,null,null,"X",null,"PAXULD"]
[670,"Austrian Airlines","OS866","CAI",{"$f":"_xlfn.XLOOKUP(' Flight data base'!D671,'airport codes'!$D$3:$D$2103,'airport codes'!$C$3:$C$2103)","v":"Egypt"},"VIE",{"$f":"_xlfn.XLOOKUP(' Flight data base'!F671,'airport codes'!$D$3:$D$2103,'airport codes'!$C$3:$C$2103)","v":"Austria"},"2021-01-03",1320,1600,"2021-01-03",null,null,null,null,null,null,"X","PAXULD"]
[671,"Austrian Airlines","OS866","CAI",{"$f":"_xlfn.XLOOKUP(' Flight data base'!D672,'airport codes'!$D$3:$D$2103,'airport codes'!$C$3:$C$2103)","v":"Egypt"},"VIE",{"$f":"_xlfn.XLOOKUP(' Flight data base'!F672,'airport codes'!$D$3:$D$2103,'airport codes'!$C$3:$C$2103)","v":"Austria"},"2021-01-04",355,635,"2021-01-04","X",null,null,null,null,null,null,"PAXULD"]
[672,"Austrian Airlines","OS866","CAI",{"$f":"_xlfn.XLOOKUP(' Flight data base'!D673,'airport codes'!$D$3:$D$2103,'airport codes'!$C$3:$C$2103)","v":"Egypt"},"VIE",{"$f":"_xlfn.XLOOKUP(' Flight data base'!F673,'airport codes'!$D$3:$D$2103,'airport codes'!$C$3:$C$2103)","v":"Austria"},"2021-01-06",1320,1600,"2021-01-06",null,null,"X",null,null,null,null,"PAXULD"]
[673,"Austrian Airlines","OS866","CAI",{"$f":"_xlfn.XLOOKUP(' Flight data base'!D674,'airport codes'!$D$3:$D$2103,'airport codes'!$C$3:$C$2103)","v":"Egypt"},"VIE",{"$f":"_xlfn.XLOOKUP(' Flight data base'!F674,'airport codes'!$D$3:$D$2103,'airport codes'!$C$3:$C$2103)","v":"Austria"},"18DEC20",320,600,"18DEC20",null,null,null,null,"X",null,null,"PAXULD"]
[674,"Austrian Airlines","OS866","CAI",{"$f":"_xlfn.XLOOKUP(' Flight data base'!D675,'airport codes'!$D$3:$D$2103,'airport codes'!$C$3:$C$2103)","v":"Egypt"},"VIE",{"$f":"_xlfn.XLOOKUP(' Flight data base'!F675,'airport codes'!$D$3:$D$2103,'airport codes'!$C$3:$C$2103)","v":"Austria"},"2021-01-08",320,600,"2021-01-29",null,null,null,null,"X",null,null,"PAXULD"]
[675,"Austrian Airlines","OS866","CAI",{"$f":"_xlfn.XLOOKUP(' Flight data base'!D676,'airport codes'!$D$3:$D$2103,'airport codes'!$C$3:$C$2103)","v":"Egypt"},"VIE",{"$f":"_xlfn.XLOOKUP(' Flight data base'!F676,'airport codes'!$D$3:$D$2103,'airport codes'!$C$3:$C$2103)","v":"Austria"},"2021-01-09",355,635,"2021-01-09",null,null,null,null,null,"X",null,"PAXULD"]
[676,"Austrian Airlines","OS866","CAI",{"$f":"_xlfn.XLOOKUP(' Flight data base'!D677,'airport codes'!$D$3:$D$2103,'airport codes'!$C$3:$C$2103)","v":"Egypt"},"VIE",{"$f":"_xlfn.XLOOKUP(' Flight data base'!F677,'airport codes'!$D$3:$D$2103,'airport codes'!$C$3:$C$2103)","v":"Austria"},"2021-01-10",1320,1600,"2021-01-24",null,null,null,null,null,null,"X","PAXULD"]
[677,"Austrian Airlines","OS866","CAI",{"$f":"_xlfn.XLOOKUP(' Flight data base'!D678,'airport codes'!$D$3:$D$2103,'airport codes'!$C$3:$C$2103)","v":"Egypt"},"VIE",{"$f":"_xlfn.XLOOKUP(' Flight data base'!F678,'airport codes'!$D$3:$D$2103,'airport codes'!$C$3:$C$2103)","v":"Austria"},"2021-01-11",355,635,"2021-01-11","X",null,null,null,null,null,null,"PAXULD"]
[678,"Austrian Airlines","OS866","CAI",{"$f":"_xlfn.XLOOKUP(' Flight data base'!D679,'airport codes'!$D$3:$D$2103,'airport codes'!$C$3:$C$2103)","v":"Egypt"},"VIE",{"$f":"_xlfn.XLOOKUP(' Flight data base'!F679,'airport codes'!$D$3:$D$2103,'airport codes'!$C$3:$C$2103)","v":"Austria"},"2021-01-13",1320,1600,"2021-01-13",null,null,"X",null,null,null,null,"PAXULD"]
[679,"Austrian Airlines","OS866","CAI",{"$f":"_xlfn.XLOOKUP(' Flight data base'!D680,'airport codes'!$D$3:$D$2103,'airport codes'!$C$3:$C$2103)","v":"Egypt"},"VIE",{"$f":"_xlfn.XLOOKUP(' Flight data base'!F680,'airport codes'!$D$3:$D$2103,'airport codes'!$C$3:$C$2103)","v":"Austria"},"25DEC20",320,600,"25DEC20",null,null,null,null,"X",null,null,"PAXULD"]
[680,"Brussels Airlines","SN1461","KGL",{"$f":"_xlfn.XLOOKUP(' Flight data base'!D681,'airport codes'!$D$3:$D$2103,'airport codes'!$C$3:$C$2103)","v":"Rwanda"},"BJM",{"$f":"_xlfn.XLOOKUP(' Flight data base'!F681,'airport codes'!$D$3:$D$2103,'airport codes'!$C$3:$C$2103)","v":"Burundi"},"2021-01-05",115,205,"2021-01-05",null,"X",null,null,null,null,null,"PAXULD"]
[681,"Brussels Airlines","SN1462","BJM",{"$f":"_xlfn.XLOOKUP(' Flight data base'!D682,'airport codes'!$D$3:$D$2103,'airport codes'!$C$3:$C$2103)","v":"Burundi"},"BRU",{"$f":"_xlfn.XLOOKUP(' Flight data base'!F682,'airport codes'!$D$3:$D$2103,'airport codes'!$C$3:$C$2103)","v":"Belgium"},"2021-01-06",2200,735,"2021-01-06",null,null,"X",null,null,null,null,"PAXULD"]
[682,"Brussels Airlines","SN1462","BJM",{"$f":"_xlfn.XLOOKUP(' Flight data base'!D683,'airport codes'!$D$3:$D$2103,'airport codes'!$C$3:$C$2103)","v":"Burundi"},"KGL",{"$f":"_xlfn.XLOOKUP(' Flight data base'!F683,'airport codes'!$D$3:$D$2103,'airport codes'!$C$3:$C$2103)","v":"Rwanda"},"2021-01-06",2200,2250,"2021-01-06",null,null,"X",null,null,null,null,"PAXULD"]
[683,"Brussels Airlines","SN1462","KGL",{"$f":"_xlfn.XLOOKUP(' Flight data base'!D684,'airport codes'!$D$3:$D$2103,'airport codes'!$C$3:$C$2103)","v":"Rwanda"},"BRU",{"$f":"_xlfn.XLOOKUP(' Flight data base'!F684,'airport codes'!$D$3:$D$2103,'airport codes'!$C$3:$C$2103)","v":"Belgium"},"2021-01-06",2359,735,"2021-01-06",null,null,"X",null,null,null,null,"PAXULD"]
[684,"Brussels Airlines","SN202","DSS",{"$f":"_xlfn.XLOOKUP(' Flight data base'!D685,'airport codes'!$D$3:$D$2103,'airport codes'!$C$3:$C$2103)","v":"Senegal"},"BRU",{"$f":"_xlfn.XLOOKUP(' Flight data base'!F685,'airport codes'!$D$3:$D$2103,'airport codes'!$C$3:$C$2103)","v":"Belgium"},"17DEC20",2240,535,"17DEC20",null,null,null,"X",null,null,null,"PAXULD"]
[685,"Brussels Airlines","SN202","DSS",{"$f":"_xlfn.XLOOKUP(' Flight data base'!D686,'airport codes'!$D$3:$D$2103,'airport codes'!$C$3:$C$2103)","v":"Senegal"},"BRU",{"$f":"_xlfn.XLOOKUP(' Flight data base'!F686,'airport codes'!$D$3:$D$2103,'airport codes'!$C$3:$C$2103)","v":"Belgium"},"20DEC20",2240,535,"20DEC20",null,null,null,null,null,null,"X","PAXULD"]
[686,"Brussels Airlines","SN202","DSS",{"$f":"_xlfn.XLOOKUP(' Flight data base'!D687,'airport codes'!$D$3:$D$2103,'airport codes'!$C$3:$C$2103)","v":"Senegal"},"BRU",{"$f":"_xlfn.XLOOKUP(' Flight data base'!F687,'airport codes'!$D$3:$D$2103,'airport codes'!$C$3:$C$2103)","v":"Belgium"},"24DEC20",2240,535,"11FEB21",null,null,null,"X",null,null,"X","PAXULD"]
[687,"Brussels Airlines","SN217","BJL",{"$f":"_xlfn.XLOOKUP(' Flight data base'!D688,'airport codes'!$D$3:$D$2103,'airport codes'!$C$3:$C$2103)","v":"Gambia"},"DSS",{"$f":"_xlfn.XLOOKUP(' Flight data base'!F688,'airport codes'!$D$3:$D$2103,'airport codes'!$C$3:$C$2103)","v":"Senegal"},"2021-01-01",2155,2235,"2021-01-04","X",null,null,null,"X",null,null,"PAXULD"]
[688,"Brussels Airlines","SN217","DSS",{"$f":"_xlfn.XLOOKUP(' Flight data base'!D689,'airport codes'!$D$3:$D$2103,'airport codes'!$C$3:$C$2103)","v":"Senegal"},"BRU",{"$f":"_xlfn.XLOOKUP(' Flight data base'!F689,'airport codes'!$D$3:$D$2103,'airport codes'!$C$3:$C$2103)","v":"Belgium"},"2021-01-01",2340,635,"2021-01-04","X",null,null,null,"X",null,null,"PAXULD"]
[689,"Brussels Airlines","SN217","BJL",{"$f":"_xlfn.XLOOKUP(' Flight data base'!D690,'airport codes'!$D$3:$D$2103,'airport codes'!$C$3:$C$2103)","v":"Gambia"},"BRU",{"$f":"_xlfn.XLOOKUP(' Flight data base'!F690,'airport codes'!$D$3:$D$2103,'airport codes'!$C$3:$C$2103)","v":"Belgium"},"2021-01-01",2155,635,"2021-01-04","X",null,null,null,"X",null,null,"PAXULD"]
[690,"Brussels Airlines","SN217","BJL",{"$f":"_xlfn.XLOOKUP(' Flight data base'!D691,'airport codes'!$D$3:$D$2103,'airport codes'!$C$3:$C$2103)","v":"Gambia"},"DSS",{"$f":"_xlfn.XLOOKUP(' Flight data base'!F691,'airport codes'!$D$3:$D$2103,'airport codes'!$C$3:$C$2103)","v":"Senegal"},"2021-01-06",2155,2235,"2021-01-13",null,null,"X",null,null,null,null,"PAXULD"]
[691,"Brussels Airlines","SN217","DSS",{"$f":"_xlfn.XLOOKUP(' Flight data base'!D692,'airport codes'!$D$3:$D$2103,'airport codes'!$C$3:$C$2103)","v":"Senegal"},"BRU",{"$f":"_xlfn.XLOOKUP(' Flight data base'!F692,'airport codes'!$D$3:$D$2103,'airport codes'!$C$3:$C$2103)","v":"Belgium"},"2021-01-06",2340,635,"2021-01-13",null,null,"X",null,null,null,null,"PAXULD"]
[692,"Brussels Airlines","SN217","BJL",{"$f":"_xlfn.XLOOKUP(' Flight data base'!D693,'airport codes'!$D$3:$D$2103,'airport codes'!$C$3:$C$2103)","v":"Gambia"},"BRU",{"$f":"_xlfn.XLOOKUP(' Flight data base'!F693,'airport codes'!$D$3:$D$2103,'airport codes'!$C$3:$C$2103)","v":"Belgium"},"2021-01-06",2155,635,"2021-01-13",null,null,"X",null,null,null,null,"PAXULD"]
[693,"Brussels Airlines","SN217","BJL",{"$f":"_xlfn.XLOOKUP(' Flight data base'!D694,'airport codes'!$D$3:$D$2103,'airport codes'!$C$3:$C$2103)","v":"Gambia"},"DSS",{"$f":"_xlfn.XLOOKUP(' Flight data base'!F694,'airport codes'!$D$3:$D$2103,'airport codes'!$C$3:$C$2103)","v":"Senegal"},"2021-01-08",2155,2235,"2021-01-15","X",null,null,null,"X",null,null,"PAXULD"]
[694,"Brussels Airlines","SN217","DSS",{"$f":"_xlfn.XLOOKUP(' Flight data base'!D695,'airport codes'!$D$3:$D$2103,'airport codes'!$C$3:$C$2103)","v":"Senegal"},"BRU",{"$f":"_xlfn.XLOOKUP(' Flight data base'!F695,'airport codes'!$D$3:$D$2103,'airport codes'!$C$3:$C$2103)","v":"Belgium"},"2021-01-08",2340,635,"2021-01-15","X",null,null,null,"X",null,null,"PAXULD"]
[695,"Brussels Airlines","SN217","BJL",{"$f":"_xlfn.XLOOKUP(' Flight data base'!D696,'airport codes'!$D$3:$D$2103,'airport codes'!$C$3:$C$2103)","v":"Gambia"},"BRU",{"$f":"_xlfn.XLOOKUP(' Flight data base'!F696,'airport codes'!$D$3:$D$2103,'airport codes'!$C$3:$C$2103)","v":"Belgium"},"2021-01-08",2155,635,"2021-01-15","X",null,null,null,"X",null,null,"PAXULD"]
[696,"Brussels Airlines","SN217","BJL",{"$f":"_xlfn.XLOOKUP(' Flight data base'!D697,'airport codes'!$D$3:$D$2103,'airport codes'!$C$3:$C$2103)","v":"Gambia"},"DSS",{"$f":"_xlfn.XLOOKUP(' Flight data base'!F697,'airport codes'!$D$3:$D$2103,'airport codes'!$C$3:$C$2103)","v":"Senegal"},"23DEC20",2155,2235,"30DEC20",null,null,"X",null,null,null,null,"PAXULD"]
[697,"Brussels Airlines","SN217","DSS",{"$f":"_xlfn.XLOOKUP(' Flight data base'!D698,'airport codes'!$D$3:$D$2103,'airport codes'!$C$3:$C$2103)","v":"Senegal"},"BRU",{"$f":"_xlfn.XLOOKUP(' Flight data base'!F698,'airport codes'!$D$3:$D$2103,'airport codes'!$C$3:$C$2103)","v":"Belgium"},"23DEC20",2340,635,"30DEC20",null,null,"X",null,null,null,null,"PAXULD"]
[698,"Brussels Airlines","SN217","BJL",{"$f":"_xlfn.XLOOKUP(' Flight data base'!D699,'airport codes'!$D$3:$D$2103,'airport codes'!$C$3:$C$2103)","v":"Gambia"},"BRU",{"$f":"_xlfn.XLOOKUP(' Flight data base'!F699,'airport codes'!$D$3:$D$2103,'airport codes'!$C$3:$C$2103)","v":"Belgium"},"23DEC20",2155,635,"30DEC20",null,null,"X",null,null,null,null,"PAXULD"]
[699,"Brussels Airlines","SN217","BJL",{"$f":"_xlfn.XLOOKUP(' Flight data base'!D700,'airport codes'!$D$3:$D$2103,'airport codes'!$C$3:$C$2103)","v":"Gambia"},"DSS",{"$f":"_xlfn.XLOOKUP(' Flight data base'!F700,'airport codes'!$D$3:$D$2103,'airport codes'!$C$3:$C$2103)","v":"Senegal"},"16DEC20",2155,2235,"16DEC20",null,null,"X",null,null,null,null,"PAXULD"]
[700,"Brussels Airlines","SN217","DSS",{"$f":"_xlfn.XLOOKUP(' Flight data base'!D701,'airport codes'!$D$3:$D$2103,'airport codes'!$C$3:$C$2103)","v":"Senegal"},"BRU",{"$f":"_xlfn.XLOOKUP(' Flight data base'!F701,'airport codes'!$D$3:$D$2103,'airport codes'!$C$3:$C$2103)","v":"Belgium"},"16DEC20",2340,635,"16DEC20",null,null,"X",null,null,null,null,"PAXULD"]
[701,"Brussels Airlines","SN217","BJL",{"$f":"_xlfn.XLOOKUP(' Flight data base'!D702,'airport codes'!$D$3:$D$2103,'airport codes'!$C$3:$C$2103)","v":"Gambia"},"BRU",{"$f":"_xlfn.XLOOKUP(' Flight data base'!F702,'airport codes'!$D$3:$D$2103,'airport codes'!$C$3:$C$2103)","v":"Belgium"},"16DEC20",2155,635,"16DEC20",null,null,"X",null,null,null,null,"PAXULD"]
[702,"Brussels Airlines","SN217","BJL",{"$f":"_xlfn.XLOOKUP(' Flight data base'!D703,'airport codes'!$D$3:$D$2103,'airport codes'!$C$3:$C$2103)","v":"Gambia"},"DSS",{"$f":"_xlfn.XLOOKUP(' Flight data base'!F703,'airport codes'!$D$3:$D$2103,'airport codes'!$C$3:$C$2103)","v":"Senegal"},"25DEC20",2155,2235,"25DEC20",null,null,null,null,"X",null,null,"PAXULD"]
[703,"Brussels Airlines","SN217","DSS",{"$f":"_xlfn.XLOOKUP(' Flight data base'!D704,'airport codes'!$D$3:$D$2103,'airport codes'!$C$3:$C$2103)","v":"Senegal"},"BRU",{"$f":"_xlfn.XLOOKUP(' Flight data base'!F704,'airport codes'!$D$3:$D$2103,'airport codes'!$C$3:$C$2103)","v":"Belgium"},"25DEC20",2340,635,"25DEC20",null,null,null,null,"X",null,null,"PAXULD"]
[704,"Brussels Airlines","SN217","BJL",{"$f":"_xlfn.XLOOKUP(' Flight data base'!D705,'airport codes'!$D$3:$D$2103,'airport codes'!$C$3:$C$2103)","v":"Gambia"},"BRU",{"$f":"_xlfn.XLOOKUP(' Flight data base'!F705,'airport codes'!$D$3:$D$2103,'airport codes'!$C$3:$C$2103)","v":"Belgium"},"25DEC20",2155,635,"25DEC20",null,null,null,null,"X",null,null,"PAXULD"]
[705,"Brussels Airlines","SN217","BJL",{"$f":"_xlfn.XLOOKUP(' Flight data base'!D706,'airport codes'!$D$3:$D$2103,'airport codes'!$C$3:$C$2103)","v":"Gambia"},"DSS",{"$f":"_xlfn.XLOOKUP(' Flight data base'!F706,'airport codes'!$D$3:$D$2103,'airport codes'!$C$3:$C$2103)","v":"Senegal"},"21DEC20",2155,2235,"21DEC20","X",null,null,null,null,null,null,"PAXULD"]
[706,"Brussels Airlines","SN217","DSS",{"$f":"_xlfn.XLOOKUP(' Flight data base'!D707,'airport codes'!$D$3:$D$2103,'airport codes'!$C$3:$C$2103)","v":"Senegal"},"BRU",{"$f":"_xlfn.XLOOKUP(' Flight data base'!F707,'airport codes'!$D$3:$D$2103,'airport codes'!$C$3:$C$2103)","v":"Belgium"},"21DEC20",2340,635,"21DEC20","X",null,null,null,null,null,null,"PAXULD"]
[707,"Brussels Airlines","SN217","BJL",{"$f":"_xlfn.XLOOKUP(' Flight data base'!D708,'airport codes'!$D$3:$D$2103,'airport codes'!$C$3:$C$2103)","v":"Gambia"},"BRU",{"$f":"_xlfn.XLOOKUP(' Flight data base'!F708,'airport codes'!$D$3:$D$2103,'airport codes'!$C$3:$C$2103)","v":"Belgium"},"21DEC20",2155,635,"21DEC20","X",null,null,null,null,null,null,"PAXULD"]
[708,"Brussels Airlines","SN217","BJL",{"$f":"_xlfn.XLOOKUP(' Flight data base'!D709,'airport codes'!$D$3:$D$2103,'airport codes'!$C$3:$C$2103)","v":"Gambia"},"DSS",{"$f":"_xlfn.XLOOKUP(' Flight data base'!F709,'airport codes'!$D$3:$D$2103,'airport codes'!$C$3:$C$2103)","v":"Senegal"},"28DEC20",2155,2235,"28DEC20","X",null,null,null,null,null,null,"PAXULD"]
[709,"Brussels Airlines","SN217","DSS",{"$f":"_xlfn.XLOOKUP(' Flight data base'!D710,'airport codes'!$D$3:$D$2103,'airport codes'!$C$3:$C$2103)","v":"Senegal"},"BRU",{"$f":"_xlfn.XLOOKUP(' Flight data base'!F710,'airport codes'!$D$3:$D$2103,'airport codes'!$C$3:$C$2103)","v":"Belgium"},"28DEC20",2340,635,"28DEC20","X",null,null,null,null,null,null,"PAXULD"]
[710,"Brussels Airlines","SN217","BJL",{"$f":"_xlfn.XLOOKUP(' Flight data base'!D711,'airport codes'!$D$3:$D$2103,'airport codes'!$C$3:$C$2103)","v":"Gambia"},"BRU",{"$f":"_xlfn.XLOOKUP(' Flight data base'!F711,'airport codes'!$D$3:$D$2103,'airport codes'!$C$3:$C$2103)","v":"Belgium"},"28DEC20",2155,635,"28DEC20","X",null,null,null,null,null,null,"PAXULD"]
[711,"Brussels Airlines","SN221","BJL",{"$f":"_xlfn.XLOOKUP(' Flight data base'!D712,'airport codes'!$D$3:$D$2103,'airport codes'!$C$3:$C$2103)","v":"Gambia"},"DSS",{"$f":"_xlfn.XLOOKUP(' Flight data base'!F712,'airport codes'!$D$3:$D$2103,'airport codes'!$C$3:$C$2103)","v":"Senegal"},"2021-01-02",2155,2235,"2021-01-02",null,null,null,null,null,"X",null,"PAXULD"]
[712,"Brussels Airlines","SN221","DSS",{"$f":"_xlfn.XLOOKUP(' Flight data base'!D713,'airport codes'!$D$3:$D$2103,'airport codes'!$C$3:$C$2103)","v":"Senegal"},"BRU",{"$f":"_xlfn.XLOOKUP(' Flight data base'!F713,'airport codes'!$D$3:$D$2103,'airport codes'!$C$3:$C$2103)","v":"Belgium"},"2021-01-02",2340,635,"2021-01-02",null,null,null,null,null,"X",null,"PAXULD"]
[713,"Brussels Airlines","SN221","BJL",{"$f":"_xlfn.XLOOKUP(' Flight data base'!D714,'airport codes'!$D$3:$D$2103,'airport codes'!$C$3:$C$2103)","v":"Gambia"},"BRU",{"$f":"_xlfn.XLOOKUP(' Flight data base'!F714,'airport codes'!$D$3:$D$2103,'airport codes'!$C$3:$C$2103)","v":"Belgium"},"2021-01-02",2155,635,"2021-01-02",null,null,null,null,null,"X",null,"PAXULD"]
[714,"Brussels Airlines","SN221","BJL",{"$f":"_xlfn.XLOOKUP(' Flight data base'!D715,'airport codes'!$D$3:$D$2103,'airport codes'!$C$3:$C$2103)","v":"Gambia"},"DSS",{"$f":"_xlfn.XLOOKUP(' Flight data base'!F715,'airport codes'!$D$3:$D$2103,'airport codes'!$C$3:$C$2103)","v":"Senegal"},"2021-01-09",2155,2235,"2021-01-09",null,null,null,null,null,"X",null,"PAXULD"]
[715,"Brussels Airlines","SN221","DSS",{"$f":"_xlfn.XLOOKUP(' Flight data base'!D716,'airport codes'!$D$3:$D$2103,'airport codes'!$C$3:$C$2103)","v":"Senegal"},"BRU",{"$f":"_xlfn.XLOOKUP(' Flight data base'!F716,'airport codes'!$D$3:$D$2103,'airport codes'!$C$3:$C$2103)","v":"Belgium"},"2021-01-09",2340,635,"2021-01-09",null,null,null,null,null,"X",null,"PAXULD"]
[716,"Brussels Airlines","SN221","BJL",{"$f":"_xlfn.XLOOKUP(' Flight data base'!D717,'airport codes'!$D$3:$D$2103,'airport codes'!$C$3:$C$2103)","v":"Gambia"},"BRU",{"$f":"_xlfn.XLOOKUP(' Flight data base'!F717,'airport codes'!$D$3:$D$2103,'airport codes'!$C$3:$C$2103)","v":"Belgium"},"2021-01-09",2155,635,"2021-01-09",null,null,null,null,null,"X",null,"PAXULD"]
[717,"Brussels Airlines","SN221","BJL",{"$f":"_xlfn.XLOOKUP(' Flight data base'!D718,'airport codes'!$D$3:$D$2103,'airport codes'!$C$3:$C$2103)","v":"Gambia"},"DSS",{"$f":"_xlfn.XLOOKUP(' Flight data base'!F718,'airport codes'!$D$3:$D$2103,'airport codes'!$C$3:$C$2103)","v":"Senegal"},"19DEC20",2155,2235,"19DEC20",null,null,null,null,null,"X",null,"PAXULD"]
[718,"Brussels Airlines","SN221","DSS",{"$f":"_xlfn.XLOOKUP(' Flight data base'!D719,'airport codes'!$D$3:$D$2103,'airport codes'!$C$3:$C$2103)","v":"Senegal"},"BRU",{"$f":"_xlfn.XLOOKUP(' Flight data base'!F719,'airport codes'!$D$3:$D$2103,'airport codes'!$C$3:$C$2103)","v":"Belgium"},"19DEC20",2340,635,"19DEC20",null,null,null,null,null,"X",null,"PAXULD"]
[719,"Brussels Airlines","SN221","BJL",{"$f":"_xlfn.XLOOKUP(' Flight data base'!D720,'airport codes'!$D$3:$D$2103,'airport codes'!$C$3:$C$2103)","v":"Gambia"},"BRU",{"$f":"_xlfn.XLOOKUP(' Flight data base'!F720,'airport codes'!$D$3:$D$2103,'airport codes'!$C$3:$C$2103)","v":"Belgium"},"19DEC20",2155,635,"19DEC20",null,null,null,null,null,"X",null,"PAXULD"]
[720,"Brussels Airlines","SN221","BJL",{"$f":"_xlfn.XLOOKUP(' Flight data base'!D721,'airport codes'!$D$3:$D$2103,'airport codes'!$C$3:$C$2103)","v":"Gambia"},"DSS",{"$f":"_xlfn.XLOOKUP(' Flight data base'!F721,'airport codes'!$D$3:$D$2103,'airport codes'!$C$3:$C$2103)","v":"Senegal"},"26DEC20",2155,2235,"26DEC20",null,null,null,null,null,"X",null,"PAXULD"]
[721,"Brussels Airlines","SN221","DSS",{"$f":"_xlfn.XLOOKUP(' Flight data base'!D722,'airport codes'!$D$3:$D$2103,'airport codes'!$C$3:$C$2103)","v":"Senegal"},"BRU",{"$f":"_xlfn.XLOOKUP(' Flight data base'!F722,'airport codes'!$D$3:$D$2103,'airport codes'!$C$3:$C$2103)","v":"Belgium"},"26DEC20",2340,635,"26DEC20",null,null,null,null,null,"X",null,"PAXULD"]
[722,"Brussels Airlines","SN221","BJL",{"$f":"_xlfn.XLOOKUP(' Flight data base'!D723,'airport codes'!$D$3:$D$2103,'airport codes'!$C$3:$C$2103)","v":"Gambia"},"BRU",{"$f":"_xlfn.XLOOKUP(' Flight data base'!F723,'airport codes'!$D$3:$D$2103,'airport codes'!$C$3:$C$2103)","v":"Belgium"},"26DEC20",2155,635,"26DEC20",null,null,null,null,null,"X",null,"PAXULD"]
[723,"Brussels Airlines","SN231","COO",{"$f":"_xlfn.XLOOKUP(' Flight data base'!D724,'airport codes'!$D$3:$D$2103,'airport codes'!$C$3:$C$2103)","v":"Benin"},"ABJ",{"$f":"_xlfn.XLOOKUP(' Flight data base'!F724,'airport codes'!$D$3:$D$2103,'airport codes'!$C$3:$C$2103)","v":"Cote d'Ivoire"},"2021-01-01",2230,2255,"2021-01-05",null,"X",null,null,"X",null,null,"PAXULD"]
[724,"Brussels Airlines","SN231","ABJ",{"$f":"_xlfn.XLOOKUP(' Flight data base'!D725,'airport codes'!$D$3:$D$2103,'airport codes'!$C$3:$C$2103)","v":"Cote d'Ivoire"},"BRU",{"$f":"_xlfn.XLOOKUP(' Flight data base'!F725,'airport codes'!$D$3:$D$2103,'airport codes'!$C$3:$C$2103)","v":"Belgium"},"2021-01-01",2355,740,"2021-01-05",null,"X",null,null,"X",null,null,"PAXULD"]
[725,"Brussels Airlines","SN231","COO",{"$f":"_xlfn.XLOOKUP(' Flight data base'!D726,'airport codes'!$D$3:$D$2103,'airport codes'!$C$3:$C$2103)","v":"Benin"},"BRU",{"$f":"_xlfn.XLOOKUP(' Flight data base'!F726,'airport codes'!$D$3:$D$2103,'airport codes'!$C$3:$C$2103)","v":"Belgium"},"2021-01-01",2230,740,"2021-01-05",null,"X",null,null,"X",null,null,"PAXULD"]
[726,"Brussels Airlines","SN231","COO",{"$f":"_xlfn.XLOOKUP(' Flight data base'!D727,'airport codes'!$D$3:$D$2103,'airport codes'!$C$3:$C$2103)","v":"Benin"},"ABJ",{"$f":"_xlfn.XLOOKUP(' Flight data base'!F727,'airport codes'!$D$3:$D$2103,'airport codes'!$C$3:$C$2103)","v":"Cote d'Ivoire"},"22DEC20",2230,2255,"29DEC20",null,"X",null,null,null,null,null,"PAXULD"]
[727,"Brussels Airlines","SN231","ABJ",{"$f":"_xlfn.XLOOKUP(' Flight data base'!D728,'airport codes'!$D$3:$D$2103,'airport codes'!$C$3:$C$2103)","v":"Cote d'Ivoire"},"BRU",{"$f":"_xlfn.XLOOKUP(' Flight data base'!F728,'airport codes'!$D$3:$D$2103,'airport codes'!$C$3:$C$2103)","v":"Belgium"},"22DEC20",2355,740,"29DEC20",null,"X",null,null,null,null,null,"PAXULD"]
[728,"Brussels Airlines","SN231","COO",{"$f":"_xlfn.XLOOKUP(' Flight data base'!D729,'airport codes'!$D$3:$D$2103,'airport codes'!$C$3:$C$2103)","v":"Benin"},"BRU",{"$f":"_xlfn.XLOOKUP(' Flight data base'!F729,'airport codes'!$D$3:$D$2103,'airport codes'!$C$3:$C$2103)","v":"Belgium"},"22DEC20",2230,740,"29DEC20",null,"X",null,null,null,null,null,"PAXULD"]
[729,"Brussels Airlines","SN231","COO",{"$f":"_xlfn.XLOOKUP(' Flight data base'!D730,'airport codes'!$D$3:$D$2103,'airport codes'!$C$3:$C$2103)","v":"Benin"},"ABJ",{"$f":"_xlfn.XLOOKUP(' Flight data base'!F730,'airport codes'!$D$3:$D$2103,'airport codes'!$C$3:$C$2103)","v":"Cote d'Ivoire"},"2021-01-08",2230,2255,"2021-01-08",null,null,null,null,"X",null,null,"PAXULD"]
[730,"Brussels Airlines","SN231","ABJ",{"$f":"_xlfn.XLOOKUP(' Flight data base'!D731,'airport codes'!$D$3:$D$2103,'airport codes'!$C$3:$C$2103)","v":"Cote d'Ivoire"},"BRU",{"$f":"_xlfn.XLOOKUP(' Flight data base'!F731,'airport codes'!$D$3:$D$2103,'airport codes'!$C$3:$C$2103)","v":"Belgium"},"2021-01-08",2355,740,"2021-01-08",null,null,null,null,"X",null,null,"PAXULD"]
[731,"Brussels Airlines","SN231","COO",{"$f":"_xlfn.XLOOKUP(' Flight data base'!D732,'airport codes'!$D$3:$D$2103,'airport codes'!$C$3:$C$2103)","v":"Benin"},"BRU",{"$f":"_xlfn.XLOOKUP(' Flight data base'!F732,'airport codes'!$D$3:$D$2103,'airport codes'!$C$3:$C$2103)","v":"Belgium"},"2021-01-08",2230,740,"2021-01-08",null,null,null,null,"X",null,null,"PAXULD"]
[732,"Brussels Airlines","SN231","COO",{"$f":"_xlfn.XLOOKUP(' Flight data base'!D733,'airport codes'!$D$3:$D$2103,'airport codes'!$C$3:$C$2103)","v":"Benin"},"ABJ",{"$f":"_xlfn.XLOOKUP(' Flight data base'!F733,'airport codes'!$D$3:$D$2103,'airport codes'!$C$3:$C$2103)","v":"Cote d'Ivoire"},"15DEC20",2230,2255,"15DEC20",null,"X",null,null,null,null,null,"PAXULD"]
[733,"Brussels Airlines","SN231","ABJ",{"$f":"_xlfn.XLOOKUP(' Flight data base'!D734,'airport codes'!$D$3:$D$2103,'airport codes'!$C$3:$C$2103)","v":"Cote d'Ivoire"},"BRU",{"$f":"_xlfn.XLOOKUP(' Flight data base'!F734,'airport codes'!$D$3:$D$2103,'airport codes'!$C$3:$C$2103)","v":"Belgium"},"15DEC20",2355,740,"15DEC20",null,"X",null,null,null,null,null,"PAXULD"]
[734,"Brussels Airlines","SN231","COO",{"$f":"_xlfn.XLOOKUP(' Flight data base'!D735,'airport codes'!$D$3:$D$2103,'airport codes'!$C$3:$C$2103)","v":"Benin"},"BRU",{"$f":"_xlfn.XLOOKUP(' Flight data base'!F735,'airport codes'!$D$3:$D$2103,'airport codes'!$C$3:$C$2103)","v":"Belgium"},"15DEC20",2230,740,"15DEC20",null,"X",null,null,null,null,null,"PAXULD"]
[735,"Brussels Airlines","SN231","COO",{"$f":"_xlfn.XLOOKUP(' Flight data base'!D736,'airport codes'!$D$3:$D$2103,'airport codes'!$C$3:$C$2103)","v":"Benin"},"ABJ",{"$f":"_xlfn.XLOOKUP(' Flight data base'!F736,'airport codes'!$D$3:$D$2103,'airport codes'!$C$3:$C$2103)","v":"Cote d'Ivoire"},"18DEC20",2230,2255,"18DEC20",null,null,null,null,"X",null,null,"PAXULD"]
[736,"Brussels Airlines","SN231","ABJ",{"$f":"_xlfn.XLOOKUP(' Flight data base'!D737,'airport codes'!$D$3:$D$2103,'airport codes'!$C$3:$C$2103)","v":"Cote d'Ivoire"},"BRU",{"$f":"_xlfn.XLOOKUP(' Flight data base'!F737,'airport codes'!$D$3:$D$2103,'airport codes'!$C$3:$C$2103)","v":"Belgium"},"18DEC20",2355,740,"18DEC20",null,null,null,null,"X",null,null,"PAXULD"]
[737,"Brussels Airlines","SN231","COO",{"$f":"_xlfn.XLOOKUP(' Flight data base'!D738,'airport codes'!$D$3:$D$2103,'airport codes'!$C$3:$C$2103)","v":"Benin"},"BRU",{"$f":"_xlfn.XLOOKUP(' Flight data base'!F738,'airport codes'!$D$3:$D$2103,'airport codes'!$C$3:$C$2103)","v":"Belgium"},"18DEC20",2230,740,"18DEC20",null,null,null,null,"X",null,null,"PAXULD"]
[738,"Brussels Airlines","SN231","COO",{"$f":"_xlfn.XLOOKUP(' Flight data base'!D739,'airport codes'!$D$3:$D$2103,'airport codes'!$C$3:$C$2103)","v":"Benin"},"ABJ",{"$f":"_xlfn.XLOOKUP(' Flight data base'!F739,'airport codes'!$D$3:$D$2103,'airport codes'!$C$3:$C$2103)","v":"Cote d'Ivoire"},"25DEC20",2230,2255,"25DEC20",null,null,null,null,"X",null,null,"PAXULD"]
[739,"Brussels Airlines","SN231","ABJ",{"$f":"_xlfn.XLOOKUP(' Flight data base'!D740,'airport codes'!$D$3:$D$2103,'airport codes'!$C$3:$C$2103)","v":"Cote d'Ivoire"},"BRU",{"$f":"_xlfn.XLOOKUP(' Flight data base'!F740,'airport codes'!$D$3:$D$2103,'airport codes'!$C$3:$C$2103)","v":"Belgium"},"25DEC20",2355,740,"25DEC20",null,null,null,null,"X",null,null,"PAXULD"]
[740,"Brussels Airlines","SN231","COO",{"$f":"_xlfn.XLOOKUP(' Flight data base'!D741,'airport codes'!$D$3:$D$2103,'airport codes'!$C$3:$C$2103)","v":"Benin"},"BRU",{"$f":"_xlfn.XLOOKUP(' Flight data base'!F741,'airport codes'!$D$3:$D$2103,'airport codes'!$C$3:$C$2103)","v":"Belgium"},"25DEC20",2230,740,"25DEC20",null,null,null,null,"X",null,null,"PAXULD"]
[741,"Brussels Airlines","SN231","COO",{"$f":"_xlfn.XLOOKUP(' Flight data base'!D742,'airport codes'!$D$3:$D$2103,'airport codes'!$C$3:$C$2103)","v":"Benin"},"ABJ",{"$f":"_xlfn.XLOOKUP(' Flight data base'!F742,'airport codes'!$D$3:$D$2103,'airport codes'!$C$3:$C$2103)","v":"Cote d'Ivoire"},"2021-01-12",2230,2255,"2021-01-12",null,"X",null,null,null,null,null,"PAXULD"]
[742,"Brussels Airlines","SN231","ABJ",{"$f":"_xlfn.XLOOKUP(' Flight data base'!D743,'airport codes'!$D$3:$D$2103,'airport codes'!$C$3:$C$2103)","v":"Cote d'Ivoire"},"BRU",{"$f":"_xlfn.XLOOKUP(' Flight data base'!F743,'airport codes'!$D$3:$D$2103,'airport codes'!$C$3:$C$2103)","v":"Belgium"},"2021-01-12",2355,740,"2021-01-12",null,"X",null,null,null,null,null,"PAXULD"]
[743,"Brussels Airlines","SN231","COO",{"$f":"_xlfn.XLOOKUP(' Flight data base'!D744,'airport codes'!$D$3:$D$2103,'airport codes'!$C$3:$C$2103)","v":"Benin"},"BRU",{"$f":"_xlfn.XLOOKUP(' Flight data base'!F744,'airport codes'!$D$3:$D$2103,'airport codes'!$C$3:$C$2103)","v":"Belgium"},"2021-01-12",2230,740,"2021-01-12",null,"X",null,null,null,null,null,"PAXULD"]
[744,"Brussels Airlines","SN241","FNA",{"$f":"_xlfn.XLOOKUP(' Flight data base'!D745,'airport codes'!$D$3:$D$2103,'airport codes'!$C$3:$C$2103)","v":"Sierra Leone"},"ROB",{"$f":"_xlfn.XLOOKUP(' Flight data base'!F745,'airport codes'!$D$3:$D$2103,'airport codes'!$C$3:$C$2103)","v":"Liberia"},"2021-01-01",2140,2240,"2021-01-01",null,null,null,null,"X",null,null,"PAXULD"]
[745,"Brussels Airlines","SN241","ROB",{"$f":"_xlfn.XLOOKUP(' Flight data base'!D746,'airport codes'!$D$3:$D$2103,'airport codes'!$C$3:$C$2103)","v":"Liberia"},"BRU",{"$f":"_xlfn.XLOOKUP(' Flight data base'!F746,'airport codes'!$D$3:$D$2103,'airport codes'!$C$3:$C$2103)","v":"Belgium"},"2021-01-01",2355,745,"2021-01-01",null,null,null,null,"X",null,null,"PAXULD"]
[746,"Brussels Airlines","SN241","FNA",{"$f":"_xlfn.XLOOKUP(' Flight data base'!D747,'airport codes'!$D$3:$D$2103,'airport codes'!$C$3:$C$2103)","v":"Sierra Leone"},"BRU",{"$f":"_xlfn.XLOOKUP(' Flight data base'!F747,'airport codes'!$D$3:$D$2103,'airport codes'!$C$3:$C$2103)","v":"Belgium"},"2021-01-01",2140,745,"2021-01-01",null,null,null,null,"X",null,null,"PAXULD"]
[747,"Brussels Airlines","SN241","FNA",{"$f":"_xlfn.XLOOKUP(' Flight data base'!D748,'airport codes'!$D$3:$D$2103,'airport codes'!$C$3:$C$2103)","v":"Sierra Leone"},"ROB",{"$f":"_xlfn.XLOOKUP(' Flight data base'!F748,'airport codes'!$D$3:$D$2103,'airport codes'!$C$3:$C$2103)","v":"Liberia"},"2021-01-03",2140,2240,"2021-01-03",null,null,null,null,null,null,"X","PAXULD"]
[748,"Brussels Airlines","SN241","ROB",{"$f":"_xlfn.XLOOKUP(' Flight data base'!D749,'airport codes'!$D$3:$D$2103,'airport codes'!$C$3:$C$2103)","v":"Liberia"},"BRU",{"$f":"_xlfn.XLOOKUP(' Flight data base'!F749,'airport codes'!$D$3:$D$2103,'airport codes'!$C$3:$C$2103)","v":"Belgium"},"2021-01-03",2355,745,"2021-01-03",null,null,null,null,null,null,"X","PAXULD"]
[749,"Brussels Airlines","SN241","FNA",{"$f":"_xlfn.XLOOKUP(' Flight data base'!D750,'airport codes'!$D$3:$D$2103,'airport codes'!$C$3:$C$2103)","v":"Sierra Leone"},"BRU",{"$f":"_xlfn.XLOOKUP(' Flight data base'!F750,'airport codes'!$D$3:$D$2103,'airport codes'!$C$3:$C$2103)","v":"Belgium"},"2021-01-03",2140,745,"2021-01-03",null,null,null,null,null,null,"X","PAXULD"]
[750,"Brussels Airlines","SN241","FNA",{"$f":"_xlfn.XLOOKUP(' Flight data base'!D751,'airport codes'!$D$3:$D$2103,'airport codes'!$C$3:$C$2103)","v":"Sierra Leone"},"ROB",{"$f":"_xlfn.XLOOKUP(' Flight data base'!F751,'airport codes'!$D$3:$D$2103,'airport codes'!$C$3:$C$2103)","v":"Liberia"},"2021-01-06",2140,2240,"2021-01-15",null,null,"X",null,"X",null,null,"PAXULD"]
[751,"Brussels Airlines","SN241","ROB",{"$f":"_xlfn.XLOOKUP(' Flight data base'!D752,'airport codes'!$D$3:$D$2103,'airport codes'!$C$3:$C$2103)","v":"Liberia"},"BRU",{"$f":"_xlfn.XLOOKUP(' Flight data base'!F752,'airport codes'!$D$3:$D$2103,'airport codes'!$C$3:$C$2103)","v":"Belgium"},"2021-01-06",2355,745,"2021-01-15",null,null,"X",null,"X",null,null,"PAXULD"]
[752,"Brussels Airlines","SN241","FNA",{"$f":"_xlfn.XLOOKUP(' Flight data base'!D753,'airport codes'!$D$3:$D$2103,'airport codes'!$C$3:$C$2103)","v":"Sierra Leone"},"BRU",{"$f":"_xlfn.XLOOKUP(' Flight data base'!F753,'airport codes'!$D$3:$D$2103,'airport codes'!$C$3:$C$2103)","v":"Belgium"},"2021-01-06",2140,745,"2021-01-15",null,null,"X",null,"X",null,null,"PAXULD"]
[753,"Brussels Airlines","SN241","FNA",{"$f":"_xlfn.XLOOKUP(' Flight data base'!D754,'airport codes'!$D$3:$D$2103,'airport codes'!$C$3:$C$2103)","v":"Sierra Leone"},"ROB",{"$f":"_xlfn.XLOOKUP(' Flight data base'!F754,'airport codes'!$D$3:$D$2103,'airport codes'!$C$3:$C$2103)","v":"Liberia"},"2021-01-10",2140,2240,"2021-01-10",null,null,null,null,null,null,"X","PAXULD"]
[754,"Brussels Airlines","SN241","ROB",{"$f":"_xlfn.XLOOKUP(' Flight data base'!D755,'airport codes'!$D$3:$D$2103,'airport codes'!$C$3:$C$2103)","v":"Liberia"},"BRU",{"$f":"_xlfn.XLOOKUP(' Flight data base'!F755,'airport codes'!$D$3:$D$2103,'airport codes'!$C$3:$C$2103)","v":"Belgium"},"2021-01-10",2355,745,"2021-01-10",null,null,null,null,null,null,"X","PAXULD"]
[755,"Brussels Airlines","SN241","FNA",{"$f":"_xlfn.XLOOKUP(' Flight data base'!D756,'airport codes'!$D$3:$D$2103,'airport codes'!$C$3:$C$2103)","v":"Sierra Leone"},"BRU",{"$f":"_xlfn.XLOOKUP(' Flight data base'!F756,'airport codes'!$D$3:$D$2103,'airport codes'!$C$3:$C$2103)","v":"Belgium"},"2021-01-10",2140,745,"2021-01-10",null,null,null,null,null,null,"X","PAXULD"]
[756,"Brussels Airlines","SN241","FNA",{"$f":"_xlfn.XLOOKUP(' Flight data base'!D757,'airport codes'!$D$3:$D$2103,'airport codes'!$C$3:$C$2103)","v":"Sierra Leone"},"ROB",{"$f":"_xlfn.XLOOKUP(' Flight data base'!F757,'airport codes'!$D$3:$D$2103,'airport codes'!$C$3:$C$2103)","v":"Liberia"},"18DEC20",2140,2240,"18DEC20",null,null,null,null,"X",null,null,"PAXULD"]
[757,"Brussels Airlines","SN241","ROB",{"$f":"_xlfn.XLOOKUP(' Flight data base'!D758,'airport codes'!$D$3:$D$2103,'airport codes'!$C$3:$C$2103)","v":"Liberia"},"BRU",{"$f":"_xlfn.XLOOKUP(' Flight data base'!F758,'airport codes'!$D$3:$D$2103,'airport codes'!$C$3:$C$2103)","v":"Belgium"},"18DEC20",2355,745,"18DEC20",null,null,null,null,"X",null,null,"PAXULD"]
[758,"Brussels Airlines","SN241","FNA",{"$f":"_xlfn.XLOOKUP(' Flight data base'!D759,'airport codes'!$D$3:$D$2103,'airport codes'!$C$3:$C$2103)","v":"Sierra Leone"},"BRU",{"$f":"_xlfn.XLOOKUP(' Flight data base'!F759,'airport codes'!$D$3:$D$2103,'airport codes'!$C$3:$C$2103)","v":"Belgium"},"18DEC20",2140,745,"18DEC20",null,null,null,null,"X",null,null,"PAXULD"]
[759,"Brussels Airlines","SN241","FNA",{"$f":"_xlfn.XLOOKUP(' Flight data base'!D760,'airport codes'!$D$3:$D$2103,'airport codes'!$C$3:$C$2103)","v":"Sierra Leone"},"ROB",{"$f":"_xlfn.XLOOKUP(' Flight data base'!F760,'airport codes'!$D$3:$D$2103,'airport codes'!$C$3:$C$2103)","v":"Liberia"},"23DEC20",2140,2240,"30DEC20",null,null,"X",null,"X",null,null,"PAXULD"]
[760,"Brussels Airlines","SN241","ROB",{"$f":"_xlfn.XLOOKUP(' Flight data base'!D761,'airport codes'!$D$3:$D$2103,'airport codes'!$C$3:$C$2103)","v":"Liberia"},"BRU",{"$f":"_xlfn.XLOOKUP(' Flight data base'!F761,'airport codes'!$D$3:$D$2103,'airport codes'!$C$3:$C$2103)","v":"Belgium"},"23DEC20",2355,745,"30DEC20",null,null,"X",null,"X",null,null,"PAXULD"]
[761,"Brussels Airlines","SN241","FNA",{"$f":"_xlfn.XLOOKUP(' Flight data base'!D762,'airport codes'!$D$3:$D$2103,'airport codes'!$C$3:$C$2103)","v":"Sierra Leone"},"BRU",{"$f":"_xlfn.XLOOKUP(' Flight data base'!F762,'airport codes'!$D$3:$D$2103,'airport codes'!$C$3:$C$2103)","v":"Belgium"},"23DEC20",2140,745,"30DEC20",null,null,"X",null,"X",null,null,"PAXULD"]
[762,"Brussels Airlines","SN241","FNA",{"$f":"_xlfn.XLOOKUP(' Flight data base'!D763,'airport codes'!$D$3:$D$2103,'airport codes'!$C$3:$C$2103)","v":"Sierra Leone"},"ROB",{"$f":"_xlfn.XLOOKUP(' Flight data base'!F763,'airport codes'!$D$3:$D$2103,'airport codes'!$C$3:$C$2103)","v":"Liberia"},"20DEC20",2140,2240,"20DEC20",null,null,null,null,null,null,"X","PAXULD"]
[763,"Brussels Airlines","SN241","ROB",{"$f":"_xlfn.XLOOKUP(' Flight data base'!D764,'airport codes'!$D$3:$D$2103,'airport codes'!$C$3:$C$2103)","v":"Liberia"},"BRU",{"$f":"_xlfn.XLOOKUP(' Flight data base'!F764,'airport codes'!$D$3:$D$2103,'airport codes'!$C$3:$C$2103)","v":"Belgium"},"20DEC20",2355,745,"20DEC20",null,null,null,null,null,null,"X","PAXULD"]
[764,"Brussels Airlines","SN241","FNA",{"$f":"_xlfn.XLOOKUP(' Flight data base'!D765,'airport codes'!$D$3:$D$2103,'airport codes'!$C$3:$C$2103)","v":"Sierra Leone"},"BRU",{"$f":"_xlfn.XLOOKUP(' Flight data base'!F765,'airport codes'!$D$3:$D$2103,'airport codes'!$C$3:$C$2103)","v":"Belgium"},"20DEC20",2140,745,"20DEC20",null,null,null,null,null,null,"X","PAXULD"]
[765,"Brussels Airlines","SN241","FNA",{"$f":"_xlfn.XLOOKUP(' Flight data base'!D766,'airport codes'!$D$3:$D$2103,'airport codes'!$C$3:$C$2103)","v":"Sierra Leone"},"ROB",{"$f":"_xlfn.XLOOKUP(' Flight data base'!F766,'airport codes'!$D$3:$D$2103,'airport codes'!$C$3:$C$2103)","v":"Liberia"},"27DEC20",2140,2240,"27DEC20",null,null,null,null,null,null,"X","PAXULD"]
[766,"Brussels Airlines","SN241","ROB",{"$f":"_xlfn.XLOOKUP(' Flight data base'!D767,'airport codes'!$D$3:$D$2103,'airport codes'!$C$3:$C$2103)","v":"Liberia"},"BRU",{"$f":"_xlfn.XLOOKUP(' Flight data base'!F767,'airport codes'!$D$3:$D$2103,'airport codes'!$C$3:$C$2103)","v":"Belgium"},"27DEC20",2355,745,"27DEC20",null,null,null,null,null,null,"X","PAXULD"]
[767,"Brussels Airlines","SN241","FNA",{"$f":"_xlfn.XLOOKUP(' Flight data base'!D768,'airport codes'!$D$3:$D$2103,'airport codes'!$C$3:$C$2103)","v":"Sierra Leone"},"BRU",{"$f":"_xlfn.XLOOKUP(' Flight data base'!F768,'airport codes'!$D$3:$D$2103,'airport codes'!$C$3:$C$2103)","v":"Belgium"},"27DEC20",2140,745,"27DEC20",null,null,null,null,null,null,"X","PAXULD"]
[768,"Brussels Airlines","SN243","FNA",{"$f":"_xlfn.XLOOKUP(' Flight data base'!D769,'airport codes'!$D$3:$D$2103,'airport codes'!$C$3:$C$2103)","v":"Sierra Leone"},"ROB",{"$f":"_xlfn.XLOOKUP(' Flight data base'!F769,'airport codes'!$D$3:$D$2103,'airport codes'!$C$3:$C$2103)","v":"Liberia"},"2021-01-05",2140,2240,"2021-01-05",null,"X",null,null,null,null,null,"PAXULD"]
[769,"Brussels Airlines","SN243","ROB",{"$f":"_xlfn.XLOOKUP(' Flight data base'!D770,'airport codes'!$D$3:$D$2103,'airport codes'!$C$3:$C$2103)","v":"Liberia"},"BRU",{"$f":"_xlfn.XLOOKUP(' Flight data base'!F770,'airport codes'!$D$3:$D$2103,'airport codes'!$C$3:$C$2103)","v":"Belgium"},"2021-01-05",2355,745,"2021-01-05",null,"X",null,null,null,null,null,"PAXULD"]
[770,"Brussels Airlines","SN243","FNA",{"$f":"_xlfn.XLOOKUP(' Flight data base'!D771,'airport codes'!$D$3:$D$2103,'airport codes'!$C$3:$C$2103)","v":"Sierra Leone"},"BRU",{"$f":"_xlfn.XLOOKUP(' Flight data base'!F771,'airport codes'!$D$3:$D$2103,'airport codes'!$C$3:$C$2103)","v":"Belgium"},"2021-01-05",2140,745,"2021-01-05",null,"X",null,null,null,null,null,"PAXULD"]
[771,"Brussels Airlines","SN243","FNA",{"$f":"_xlfn.XLOOKUP(' Flight data base'!D772,'airport codes'!$D$3:$D$2103,'airport codes'!$C$3:$C$2103)","v":"Sierra Leone"},"ROB",{"$f":"_xlfn.XLOOKUP(' Flight data base'!F772,'airport codes'!$D$3:$D$2103,'airport codes'!$C$3:$C$2103)","v":"Liberia"},"15DEC20",2140,2240,"15DEC20",null,"X",null,null,null,null,null,"PAXULD"]
[772,"Brussels Airlines","SN243","ROB",{"$f":"_xlfn.XLOOKUP(' Flight data base'!D773,'airport codes'!$D$3:$D$2103,'airport codes'!$C$3:$C$2103)","v":"Liberia"},"BRU",{"$f":"_xlfn.XLOOKUP(' Flight data base'!F773,'airport codes'!$D$3:$D$2103,'airport codes'!$C$3:$C$2103)","v":"Belgium"},"15DEC20",2355,745,"15DEC20",null,"X",null,null,null,null,null,"PAXULD"]
[773,"Brussels Airlines","SN243","FNA",{"$f":"_xlfn.XLOOKUP(' Flight data base'!D774,'airport codes'!$D$3:$D$2103,'airport codes'!$C$3:$C$2103)","v":"Sierra Leone"},"BRU",{"$f":"_xlfn.XLOOKUP(' Flight data base'!F774,'airport codes'!$D$3:$D$2103,'airport codes'!$C$3:$C$2103)","v":"Belgium"},"15DEC20",2140,745,"15DEC20",null,"X",null,null,null,null,null,"PAXULD"]
[774,"Brussels Airlines","SN243","FNA",{"$f":"_xlfn.XLOOKUP(' Flight data base'!D775,'airport codes'!$D$3:$D$2103,'airport codes'!$C$3:$C$2103)","v":"Sierra Leone"},"ROB",{"$f":"_xlfn.XLOOKUP(' Flight data base'!F775,'airport codes'!$D$3:$D$2103,'airport codes'!$C$3:$C$2103)","v":"Liberia"},"17DEC20",2140,2240,"17DEC20",null,null,null,"X",null,null,null,"PAXULD"]
[775,"Brussels Airlines","SN243","ROB",{"$f":"_xlfn.XLOOKUP(' Flight data base'!D776,'airport codes'!$D$3:$D$2103,'airport codes'!$C$3:$C$2103)","v":"Liberia"},"BRU",{"$f":"_xlfn.XLOOKUP(' Flight data base'!F776,'airport codes'!$D$3:$D$2103,'airport codes'!$C$3:$C$2103)","v":"Belgium"},"17DEC20",2355,745,"17DEC20",null,null,null,"X",null,null,null,"PAXULD"]
[776,"Brussels Airlines","SN243","FNA",{"$f":"_xlfn.XLOOKUP(' Flight data base'!D777,'airport codes'!$D$3:$D$2103,'airport codes'!$C$3:$C$2103)","v":"Sierra Leone"},"BRU",{"$f":"_xlfn.XLOOKUP(' Flight data base'!F777,'airport codes'!$D$3:$D$2103,'airport codes'!$C$3:$C$2103)","v":"Belgium"},"17DEC20",2140,745,"17DEC20",null,null,null,"X",null,null,null,"PAXULD"]
[777,"Brussels Airlines","SN243","FNA",{"$f":"_xlfn.XLOOKUP(' Flight data base'!D778,'airport codes'!$D$3:$D$2103,'airport codes'!$C$3:$C$2103)","v":"Sierra Leone"},"ROB",{"$f":"_xlfn.XLOOKUP(' Flight data base'!F778,'airport codes'!$D$3:$D$2103,'airport codes'!$C$3:$C$2103)","v":"Liberia"},"2021-01-12",2140,2240,"2021-01-12",null,"X",null,null,null,null,null,"PAXULD"]
[778,"Brussels Airlines","SN243","ROB",{"$f":"_xlfn.XLOOKUP(' Flight data base'!D779,'airport codes'!$D$3:$D$2103,'airport codes'!$C$3:$C$2103)","v":"Liberia"},"BRU",{"$f":"_xlfn.XLOOKUP(' Flight data base'!F779,'airport codes'!$D$3:$D$2103,'airport codes'!$C$3:$C$2103)","v":"Belgium"},"2021-01-12",2355,745,"2021-01-12",null,"X",null,null,null,null,null,"PAXULD"]
[779,"Brussels Airlines","SN243","FNA",{"$f":"_xlfn.XLOOKUP(' Flight data base'!D780,'airport codes'!$D$3:$D$2103,'airport codes'!$C$3:$C$2103)","v":"Sierra Leone"},"BRU",{"$f":"_xlfn.XLOOKUP(' Flight data base'!F780,'airport codes'!$D$3:$D$2103,'airport codes'!$C$3:$C$2103)","v":"Belgium"},"2021-01-12",2140,745,"2021-01-12",null,"X",null,null,null,null,null,"PAXULD"]
[780,"Brussels Airlines","SN245","FNA",{"$f":"_xlfn.XLOOKUP(' Flight data base'!D781,'airport codes'!$D$3:$D$2103,'airport codes'!$C$3:$C$2103)","v":"Sierra Leone"},"ROB",{"$f":"_xlfn.XLOOKUP(' Flight data base'!F781,'airport codes'!$D$3:$D$2103,'airport codes'!$C$3:$C$2103)","v":"Liberia"},"2021-01-11",2140,2240,"2021-01-25","X",null,null,null,null,null,null,"PAXULD"]
[781,"Brussels Airlines","SN245","ROB",{"$f":"_xlfn.XLOOKUP(' Flight data base'!D782,'airport codes'!$D$3:$D$2103,'airport codes'!$C$3:$C$2103)","v":"Liberia"},"BRU",{"$f":"_xlfn.XLOOKUP(' Flight data base'!F782,'airport codes'!$D$3:$D$2103,'airport codes'!$C$3:$C$2103)","v":"Belgium"},"2021-01-11",2355,745,"2021-01-25","X",null,null,null,null,null,null,"PAXULD"]
[782,"Brussels Airlines","SN245","FNA",{"$f":"_xlfn.XLOOKUP(' Flight data base'!D783,'airport codes'!$D$3:$D$2103,'airport codes'!$C$3:$C$2103)","v":"Sierra Leone"},"BRU",{"$f":"_xlfn.XLOOKUP(' Flight data base'!F783,'airport codes'!$D$3:$D$2103,'airport codes'!$C$3:$C$2103)","v":"Belgium"},"2021-01-11",2140,745,"2021-01-25","X",null,null,null,null,null,null,"PAXULD"]
[783,"Brussels Airlines","SN245","FNA",{"$f":"_xlfn.XLOOKUP(' Flight data base'!D784,'airport codes'!$D$3:$D$2103,'airport codes'!$C$3:$C$2103)","v":"Sierra Leone"},"ROB",{"$f":"_xlfn.XLOOKUP(' Flight data base'!F784,'airport codes'!$D$3:$D$2103,'airport codes'!$C$3:$C$2103)","v":"Liberia"},"21DEC20",2140,2240,"21DEC20","X",null,null,null,null,null,null,"PAXULD"]
[784,"Brussels Airlines","SN245","ROB",{"$f":"_xlfn.XLOOKUP(' Flight data base'!D785,'airport codes'!$D$3:$D$2103,'airport codes'!$C$3:$C$2103)","v":"Liberia"},"BRU",{"$f":"_xlfn.XLOOKUP(' Flight data base'!F785,'airport codes'!$D$3:$D$2103,'airport codes'!$C$3:$C$2103)","v":"Belgium"},"21DEC20",2355,745,"21DEC20","X",null,null,null,null,null,null,"PAXULD"]
[785,"Brussels Airlines","SN245","FNA",{"$f":"_xlfn.XLOOKUP(' Flight data base'!D786,'airport codes'!$D$3:$D$2103,'airport codes'!$C$3:$C$2103)","v":"Sierra Leone"},"BRU",{"$f":"_xlfn.XLOOKUP(' Flight data base'!F786,'airport codes'!$D$3:$D$2103,'airport codes'!$C$3:$C$2103)","v":"Belgium"},"21DEC20",2140,745,"21DEC20","X",null,null,null,null,null,null,"PAXULD"]
[786,"Brussels Airlines","SN245","FNA",{"$f":"_xlfn.XLOOKUP(' Flight data base'!D787,'airport codes'!$D$3:$D$2103,'airport codes'!$C$3:$C$2103)","v":"Sierra Leone"},"ROB",{"$f":"_xlfn.XLOOKUP(' Flight data base'!F787,'airport codes'!$D$3:$D$2103,'airport codes'!$C$3:$C$2103)","v":"Liberia"},"28DEC20",2140,2240,"2021-01-04","X",null,null,null,null,null,null,"PAXULD"]
[787,"Brussels Airlines","SN245","ROB",{"$f":"_xlfn.XLOOKUP(' Flight data base'!D788,'airport codes'!$D$3:$D$2103,'airport codes'!$C$3:$C$2103)","v":"Liberia"},"BRU",{"$f":"_xlfn.XLOOKUP(' Flight data base'!F788,'airport codes'!$D$3:$D$2103,'airport codes'!$C$3:$C$2103)","v":"Belgium"},"28DEC20",2355,745,"2021-01-04","X",null,null,null,null,null,null,"PAXULD"]
[788,"Brussels Airlines","SN245","FNA",{"$f":"_xlfn.XLOOKUP(' Flight data base'!D789,'airport codes'!$D$3:$D$2103,'airport codes'!$C$3:$C$2103)","v":"Sierra Leone"},"BRU",{"$f":"_xlfn.XLOOKUP(' Flight data base'!F789,'airport codes'!$D$3:$D$2103,'airport codes'!$C$3:$C$2103)","v":"Belgium"},"28DEC20",2140,745,"2021-01-04","X",null,null,null,null,null,null,"PAXULD"]
[789,"Brussels Airlines","SN253","LFW",{"$f":"_xlfn.XLOOKUP(' Flight data base'!D790,'airport codes'!$D$3:$D$2103,'airport codes'!$C$3:$C$2103)","v":"Togo"},"ABJ",{"$f":"_xlfn.XLOOKUP(' Flight data base'!F790,'airport codes'!$D$3:$D$2103,'airport codes'!$C$3:$C$2103)","v":"Cote d'Ivoire"},"27DEC20",2140,2255,"2021-01-03",null,null,null,null,null,null,"X","PAXULD"]
[790,"Brussels Airlines","SN253","ABJ",{"$f":"_xlfn.XLOOKUP(' Flight data base'!D791,'airport codes'!$D$3:$D$2103,'airport codes'!$C$3:$C$2103)","v":"Cote d'Ivoire"},"BRU",{"$f":"_xlfn.XLOOKUP(' Flight data base'!F791,'airport codes'!$D$3:$D$2103,'airport codes'!$C$3:$C$2103)","v":"Belgium"},"27DEC20",2355,740,"2021-01-03",null,null,null,null,null,null,"X","PAXULD"]
[791,"Brussels Airlines","SN253","LFW",{"$f":"_xlfn.XLOOKUP(' Flight data base'!D792,'airport codes'!$D$3:$D$2103,'airport codes'!$C$3:$C$2103)","v":"Togo"},"BRU",{"$f":"_xlfn.XLOOKUP(' Flight data base'!F792,'airport codes'!$D$3:$D$2103,'airport codes'!$C$3:$C$2103)","v":"Belgium"},"27DEC20",2140,740,"2021-01-03",null,null,null,null,null,null,"X","PAXULD"]
[792,"Brussels Airlines","SN253","LFW",{"$f":"_xlfn.XLOOKUP(' Flight data base'!D793,'airport codes'!$D$3:$D$2103,'airport codes'!$C$3:$C$2103)","v":"Togo"},"ABJ",{"$f":"_xlfn.XLOOKUP(' Flight data base'!F793,'airport codes'!$D$3:$D$2103,'airport codes'!$C$3:$C$2103)","v":"Cote d'Ivoire"},"30DEC20",2140,2255,"30DEC20",null,null,"X",null,null,null,null,"PAXULD"]
[793,"Brussels Airlines","SN253","ABJ",{"$f":"_xlfn.XLOOKUP(' Flight data base'!D794,'airport codes'!$D$3:$D$2103,'airport codes'!$C$3:$C$2103)","v":"Cote d'Ivoire"},"BRU",{"$f":"_xlfn.XLOOKUP(' Flight data base'!F794,'airport codes'!$D$3:$D$2103,'airport codes'!$C$3:$C$2103)","v":"Belgium"},"30DEC20",2355,740,"30DEC20",null,null,"X",null,null,null,null,"PAXULD"]
[794,"Brussels Airlines","SN253","LFW",{"$f":"_xlfn.XLOOKUP(' Flight data base'!D795,'airport codes'!$D$3:$D$2103,'airport codes'!$C$3:$C$2103)","v":"Togo"},"BRU",{"$f":"_xlfn.XLOOKUP(' Flight data base'!F795,'airport codes'!$D$3:$D$2103,'airport codes'!$C$3:$C$2103)","v":"Belgium"},"30DEC20",2140,740,"30DEC20",null,null,"X",null,null,null,null,"PAXULD"]
[795,"Brussels Airlines","SN253","LFW",{"$f":"_xlfn.XLOOKUP(' Flight data base'!D796,'airport codes'!$D$3:$D$2103,'airport codes'!$C$3:$C$2103)","v":"Togo"},"ABJ",{"$f":"_xlfn.XLOOKUP(' Flight data base'!F796,'airport codes'!$D$3:$D$2103,'airport codes'!$C$3:$C$2103)","v":"Cote d'Ivoire"},"2021-01-06",2140,2255,"2021-01-13",null,null,"X",null,null,null,"X","PAXULD"]
[796,"Brussels Airlines","SN253","ABJ",{"$f":"_xlfn.XLOOKUP(' Flight data base'!D797,'airport codes'!$D$3:$D$2103,'airport codes'!$C$3:$C$2103)","v":"Cote d'Ivoire"},"BRU",{"$f":"_xlfn.XLOOKUP(' Flight data base'!F797,'airport codes'!$D$3:$D$2103,'airport codes'!$C$3:$C$2103)","v":"Belgium"},"2021-01-06",2355,740,"2021-01-13",null,null,"X",null,null,null,"X","PAXULD"]
[797,"Brussels Airlines","SN253","LFW",{"$f":"_xlfn.XLOOKUP(' Flight data base'!D798,'airport codes'!$D$3:$D$2103,'airport codes'!$C$3:$C$2103)","v":"Togo"},"BRU",{"$f":"_xlfn.XLOOKUP(' Flight data base'!F798,'airport codes'!$D$3:$D$2103,'airport codes'!$C$3:$C$2103)","v":"Belgium"},"2021-01-06",2140,740,"2021-01-13",null,null,"X",null,null,null,"X","PAXULD"]
[798,"Brussels Airlines","SN253","LFW",{"$f":"_xlfn.XLOOKUP(' Flight data base'!D799,'airport codes'!$D$3:$D$2103,'airport codes'!$C$3:$C$2103)","v":"Togo"},"ABJ",{"$f":"_xlfn.XLOOKUP(' Flight data base'!F799,'airport codes'!$D$3:$D$2103,'airport codes'!$C$3:$C$2103)","v":"Cote d'Ivoire"},"16DEC20",2140,2255,"16DEC20",null,null,"X",null,null,null,null,"PAXULD"]
[799,"Brussels Airlines","SN253","ABJ",{"$f":"_xlfn.XLOOKUP(' Flight data base'!D800,'airport codes'!$D$3:$D$2103,'airport codes'!$C$3:$C$2103)","v":"Cote d'Ivoire"},"BRU",{"$f":"_xlfn.XLOOKUP(' Flight data base'!F800,'airport codes'!$D$3:$D$2103,'airport codes'!$C$3:$C$2103)","v":"Belgium"},"16DEC20",2355,740,"16DEC20",null,null,"X",null,null,null,null,"PAXULD"]
[800,"Brussels Airlines","SN253","LFW",{"$f":"_xlfn.XLOOKUP(' Flight data base'!D801,'airport codes'!$D$3:$D$2103,'airport codes'!$C$3:$C$2103)","v":"Togo"},"BRU",{"$f":"_xlfn.XLOOKUP(' Flight data base'!F801,'airport codes'!$D$3:$D$2103,'airport codes'!$C$3:$C$2103)","v":"Belgium"},"16DEC20",2140,740,"16DEC20",null,null,"X",null,null,null,null,"PAXULD"]
[801,"Brussels Airlines","SN253","LFW",{"$f":"_xlfn.XLOOKUP(' Flight data base'!D802,'airport codes'!$D$3:$D$2103,'airport codes'!$C$3:$C$2103)","v":"Togo"},"ABJ",{"$f":"_xlfn.XLOOKUP(' Flight data base'!F802,'airport codes'!$D$3:$D$2103,'airport codes'!$C$3:$C$2103)","v":"Cote d'Ivoire"},"20DEC20",2140,2255,"20DEC20",null,null,null,null,null,null,"X","PAXULD"]
[802,"Brussels Airlines","SN253","ABJ",{"$f":"_xlfn.XLOOKUP(' Flight data base'!D803,'airport codes'!$D$3:$D$2103,'airport codes'!$C$3:$C$2103)","v":"Cote d'Ivoire"},"BRU",{"$f":"_xlfn.XLOOKUP(' Flight data base'!F803,'airport codes'!$D$3:$D$2103,'airport codes'!$C$3:$C$2103)","v":"Belgium"},"20DEC20",2355,740,"20DEC20",null,null,null,null,null,null,"X","PAXULD"]
[803,"Brussels Airlines","SN253","LFW",{"$f":"_xlfn.XLOOKUP(' Flight data base'!D804,'airport codes'!$D$3:$D$2103,'airport codes'!$C$3:$C$2103)","v":"Togo"},"BRU",{"$f":"_xlfn.XLOOKUP(' Flight data base'!F804,'airport codes'!$D$3:$D$2103,'airport codes'!$C$3:$C$2103)","v":"Belgium"},"20DEC20",2140,740,"20DEC20",null,null,null,null,null,null,"X","PAXULD"]
[804,"Brussels Airlines","SN253","LFW",{"$f":"_xlfn.XLOOKUP(' Flight data base'!D805,'airport codes'!$D$3:$D$2103,'airport codes'!$C$3:$C$2103)","v":"Togo"},"ABJ",{"$f":"_xlfn.XLOOKUP(' Flight data base'!F805,'airport codes'!$D$3:$D$2103,'airport codes'!$C$3:$C$2103)","v":"Cote d'Ivoire"},"23DEC20",2140,2255,"23DEC20",null,null,"X",null,null,null,null,"PAXULD"]
[805,"Brussels Airlines","SN253","ABJ",{"$f":"_xlfn.XLOOKUP(' Flight data base'!D806,'airport codes'!$D$3:$D$2103,'airport codes'!$C$3:$C$2103)","v":"Cote d'Ivoire"},"BRU",{"$f":"_xlfn.XLOOKUP(' Flight data base'!F806,'airport codes'!$D$3:$D$2103,'airport codes'!$C$3:$C$2103)","v":"Belgium"},"23DEC20",2355,740,"23DEC20",null,null,"X",null,null,null,null,"PAXULD"]
[806,"Brussels Airlines","SN253","LFW",{"$f":"_xlfn.XLOOKUP(' Flight data base'!D807,'airport codes'!$D$3:$D$2103,'airport codes'!$C$3:$C$2103)","v":"Togo"},"BRU",{"$f":"_xlfn.XLOOKUP(' Flight data base'!F807,'airport codes'!$D$3:$D$2103,'airport codes'!$C$3:$C$2103)","v":"Belgium"},"23DEC20",2140,740,"23DEC20",null,null,"X",null,null,null,null,"PAXULD"]
[807,"Brussels Airlines","SN291","ACC",{"$f":"_xlfn.XLOOKUP(' Flight data base'!D808,'airport codes'!$D$3:$D$2103,'airport codes'!$C$3:$C$2103)","v":"Ghana"},"ABJ",{"$f":"_xlfn.XLOOKUP(' Flight data base'!F808,'airport codes'!$D$3:$D$2103,'airport codes'!$C$3:$C$2103)","v":"Cote d'Ivoire"},"24DEC20",2145,2250,"26DEC20",null,null,null,"X",null,"X",null,"PAXULD"]
[808,"Brussels Airlines","SN291","ABJ",{"$f":"_xlfn.XLOOKUP(' Flight data base'!D809,'airport codes'!$D$3:$D$2103,'airport codes'!$C$3:$C$2103)","v":"Cote d'Ivoire"},"BRU",{"$f":"_xlfn.XLOOKUP(' Flight data base'!F809,'airport codes'!$D$3:$D$2103,'airport codes'!$C$3:$C$2103)","v":"Belgium"},"24DEC20",2355,740,"26DEC20",null,null,null,"X",null,"X",null,"PAXULD"]
[809,"Brussels Airlines","SN291","ACC",{"$f":"_xlfn.XLOOKUP(' Flight data base'!D810,'airport codes'!$D$3:$D$2103,'airport codes'!$C$3:$C$2103)","v":"Ghana"},"BRU",{"$f":"_xlfn.XLOOKUP(' Flight data base'!F810,'airport codes'!$D$3:$D$2103,'airport codes'!$C$3:$C$2103)","v":"Belgium"},"24DEC20",2145,740,"26DEC20",null,null,null,"X",null,"X",null,"PAXULD"]
[810,"Brussels Airlines","SN291","ACC",{"$f":"_xlfn.XLOOKUP(' Flight data base'!D811,'airport codes'!$D$3:$D$2103,'airport codes'!$C$3:$C$2103)","v":"Ghana"},"ABJ",{"$f":"_xlfn.XLOOKUP(' Flight data base'!F811,'airport codes'!$D$3:$D$2103,'airport codes'!$C$3:$C$2103)","v":"Cote d'Ivoire"},"31DEC20",2145,2250,"31DEC20",null,null,null,"X",null,null,null,"PAXULD"]
[811,"Brussels Airlines","SN291","ABJ",{"$f":"_xlfn.XLOOKUP(' Flight data base'!D812,'airport codes'!$D$3:$D$2103,'airport codes'!$C$3:$C$2103)","v":"Cote d'Ivoire"},"BRU",{"$f":"_xlfn.XLOOKUP(' Flight data base'!F812,'airport codes'!$D$3:$D$2103,'airport codes'!$C$3:$C$2103)","v":"Belgium"},"31DEC20",2355,740,"31DEC20",null,null,null,"X",null,null,null,"PAXULD"]
[812,"Brussels Airlines","SN291","ACC",{"$f":"_xlfn.XLOOKUP(' Flight data base'!D813,'airport codes'!$D$3:$D$2103,'airport codes'!$C$3:$C$2103)","v":"Ghana"},"BRU",{"$f":"_xlfn.XLOOKUP(' Flight data base'!F813,'airport codes'!$D$3:$D$2103,'airport codes'!$C$3:$C$2103)","v":"Belgium"},"31DEC20",2145,740,"31DEC20",null,null,null,"X",null,null,null,"PAXULD"]
[813,"Brussels Airlines","SN291","ACC",{"$f":"_xlfn.XLOOKUP(' Flight data base'!D814,'airport codes'!$D$3:$D$2103,'airport codes'!$C$3:$C$2103)","v":"Ghana"},"ABJ",{"$f":"_xlfn.XLOOKUP(' Flight data base'!F814,'airport codes'!$D$3:$D$2103,'airport codes'!$C$3:$C$2103)","v":"Cote d'Ivoire"},"2021-01-02",2145,2250,"2021-01-02",null,null,null,null,null,"X",null,"PAXULD"]
[814,"Brussels Airlines","SN291","ABJ",{"$f":"_xlfn.XLOOKUP(' Flight data base'!D815,'airport codes'!$D$3:$D$2103,'airport codes'!$C$3:$C$2103)","v":"Cote d'Ivoire"},"BRU",{"$f":"_xlfn.XLOOKUP(' Flight data base'!F815,'airport codes'!$D$3:$D$2103,'airport codes'!$C$3:$C$2103)","v":"Belgium"},"2021-01-02",2355,740,"2021-01-02",null,null,null,null,null,"X",null,"PAXULD"]
[815,"Brussels Airlines","SN291","ACC",{"$f":"_xlfn.XLOOKUP(' Flight data base'!D816,'airport codes'!$D$3:$D$2103,'airport codes'!$C$3:$C$2103)","v":"Ghana"},"BRU",{"$f":"_xlfn.XLOOKUP(' Flight data base'!F816,'airport codes'!$D$3:$D$2103,'airport codes'!$C$3:$C$2103)","v":"Belgium"},"2021-01-02",2145,740,"2021-01-02",null,null,null,null,null,"X",null,"PAXULD"]
[816,"Brussels Airlines","SN291","ACC",{"$f":"_xlfn.XLOOKUP(' Flight data base'!D817,'airport codes'!$D$3:$D$2103,'airport codes'!$C$3:$C$2103)","v":"Ghana"},"ABJ",{"$f":"_xlfn.XLOOKUP(' Flight data base'!F817,'airport codes'!$D$3:$D$2103,'airport codes'!$C$3:$C$2103)","v":"Cote d'Ivoire"},"2021-01-04",2145,2250,"2021-01-04","X",null,null,null,null,null,null,"PAXULD"]
[817,"Brussels Airlines","SN291","ABJ",{"$f":"_xlfn.XLOOKUP(' Flight data base'!D818,'airport codes'!$D$3:$D$2103,'airport codes'!$C$3:$C$2103)","v":"Cote d'Ivoire"},"BRU",{"$f":"_xlfn.XLOOKUP(' Flight data base'!F818,'airport codes'!$D$3:$D$2103,'airport codes'!$C$3:$C$2103)","v":"Belgium"},"2021-01-04",2355,740,"2021-01-04","X",null,null,null,null,null,null,"PAXULD"]
[818,"Brussels Airlines","SN291","ACC",{"$f":"_xlfn.XLOOKUP(' Flight data base'!D819,'airport codes'!$D$3:$D$2103,'airport codes'!$C$3:$C$2103)","v":"Ghana"},"BRU",{"$f":"_xlfn.XLOOKUP(' Flight data base'!F819,'airport codes'!$D$3:$D$2103,'airport codes'!$C$3:$C$2103)","v":"Belgium"},"2021-01-04",2145,740,"2021-01-04","X",null,null,null,null,null,null,"PAXULD"]
[819,"Brussels Airlines","SN291","ACC",{"$f":"_xlfn.XLOOKUP(' Flight data base'!D820,'airport codes'!$D$3:$D$2103,'airport codes'!$C$3:$C$2103)","v":"Ghana"},"ABJ",{"$f":"_xlfn.XLOOKUP(' Flight data base'!F820,'airport codes'!$D$3:$D$2103,'airport codes'!$C$3:$C$2103)","v":"Cote d'Ivoire"},"2021-01-07",2145,2250,"2021-01-14","X",null,null,"X",null,"X",null,"PAXULD"]
[820,"Brussels Airlines","SN291","ABJ",{"$f":"_xlfn.XLOOKUP(' Flight data base'!D821,'airport codes'!$D$3:$D$2103,'airport codes'!$C$3:$C$2103)","v":"Cote d'Ivoire"},"BRU",{"$f":"_xlfn.XLOOKUP(' Flight data base'!F821,'airport codes'!$D$3:$D$2103,'airport codes'!$C$3:$C$2103)","v":"Belgium"},"2021-01-07",2355,740,"2021-01-14","X",null,null,"X",null,"X",null,"PAXULD"]
[821,"Brussels Airlines","SN291","ACC",{"$f":"_xlfn.XLOOKUP(' Flight data base'!D822,'airport codes'!$D$3:$D$2103,'airport codes'!$C$3:$C$2103)","v":"Ghana"},"BRU",{"$f":"_xlfn.XLOOKUP(' Flight data base'!F822,'airport codes'!$D$3:$D$2103,'airport codes'!$C$3:$C$2103)","v":"Belgium"},"2021-01-07",2145,740,"2021-01-14","X",null,null,"X",null,"X",null,"PAXULD"]
[822,"Brussels Airlines","SN291","ACC",{"$f":"_xlfn.XLOOKUP(' Flight data base'!D823,'airport codes'!$D$3:$D$2103,'airport codes'!$C$3:$C$2103)","v":"Ghana"},"ABJ",{"$f":"_xlfn.XLOOKUP(' Flight data base'!F823,'airport codes'!$D$3:$D$2103,'airport codes'!$C$3:$C$2103)","v":"Cote d'Ivoire"},"17DEC20",2145,2250,"17DEC20",null,null,null,"X",null,null,null,"PAXULD"]
[823,"Brussels Airlines","SN291","ABJ",{"$f":"_xlfn.XLOOKUP(' Flight data base'!D824,'airport codes'!$D$3:$D$2103,'airport codes'!$C$3:$C$2103)","v":"Cote d'Ivoire"},"BRU",{"$f":"_xlfn.XLOOKUP(' Flight data base'!F824,'airport codes'!$D$3:$D$2103,'airport codes'!$C$3:$C$2103)","v":"Belgium"},"17DEC20",2355,740,"17DEC20",null,null,null,"X",null,null,null,"PAXULD"]
[824,"Brussels Airlines","SN291","ACC",{"$f":"_xlfn.XLOOKUP(' Flight data base'!D825,'airport codes'!$D$3:$D$2103,'airport codes'!$C$3:$C$2103)","v":"Ghana"},"BRU",{"$f":"_xlfn.XLOOKUP(' Flight data base'!F825,'airport codes'!$D$3:$D$2103,'airport codes'!$C$3:$C$2103)","v":"Belgium"},"17DEC20",2145,740,"17DEC20",null,null,null,"X",null,null,null,"PAXULD"]
[825,"Brussels Airlines","SN291","ACC",{"$f":"_xlfn.XLOOKUP(' Flight data base'!D826,'airport codes'!$D$3:$D$2103,'airport codes'!$C$3:$C$2103)","v":"Ghana"},"ABJ",{"$f":"_xlfn.XLOOKUP(' Flight data base'!F826,'airport codes'!$D$3:$D$2103,'airport codes'!$C$3:$C$2103)","v":"Cote d'Ivoire"},"19DEC20",2145,2250,"19DEC20",null,null,null,null,null,"X",null,"PAXULD"]
[826,"Brussels Airlines","SN291","ABJ",{"$f":"_xlfn.XLOOKUP(' Flight data base'!D827,'airport codes'!$D$3:$D$2103,'airport codes'!$C$3:$C$2103)","v":"Cote d'Ivoire"},"BRU",{"$f":"_xlfn.XLOOKUP(' Flight data base'!F827,'airport codes'!$D$3:$D$2103,'airport codes'!$C$3:$C$2103)","v":"Belgium"},"19DEC20",2355,740,"19DEC20",null,null,null,null,null,"X",null,"PAXULD"]
[827,"Brussels Airlines","SN291","ACC",{"$f":"_xlfn.XLOOKUP(' Flight data base'!D828,'airport codes'!$D$3:$D$2103,'airport codes'!$C$3:$C$2103)","v":"Ghana"},"BRU",{"$f":"_xlfn.XLOOKUP(' Flight data base'!F828,'airport codes'!$D$3:$D$2103,'airport codes'!$C$3:$C$2103)","v":"Belgium"},"19DEC20",2145,740,"19DEC20",null,null,null,null,null,"X",null,"PAXULD"]
[828,"Brussels Airlines","SN291","ACC",{"$f":"_xlfn.XLOOKUP(' Flight data base'!D829,'airport codes'!$D$3:$D$2103,'airport codes'!$C$3:$C$2103)","v":"Ghana"},"ABJ",{"$f":"_xlfn.XLOOKUP(' Flight data base'!F829,'airport codes'!$D$3:$D$2103,'airport codes'!$C$3:$C$2103)","v":"Cote d'Ivoire"},"21DEC20",2145,2250,"21DEC20","X",null,null,null,null,null,null,"PAXULD"]
[829,"Brussels Airlines","SN291","ABJ",{"$f":"_xlfn.XLOOKUP(' Flight data base'!D830,'airport codes'!$D$3:$D$2103,'airport codes'!$C$3:$C$2103)","v":"Cote d'Ivoire"},"BRU",{"$f":"_xlfn.XLOOKUP(' Flight data base'!F830,'airport codes'!$D$3:$D$2103,'airport codes'!$C$3:$C$2103)","v":"Belgium"},"21DEC20",2355,740,"21DEC20","X",null,null,null,null,null,null,"PAXULD"]
[830,"Brussels Airlines","SN291","ACC",{"$f":"_xlfn.XLOOKUP(' Flight data base'!D831,'airport codes'!$D$3:$D$2103,'airport codes'!$C$3:$C$2103)","v":"Ghana"},"BRU",{"$f":"_xlfn.XLOOKUP(' Flight data base'!F831,'airport codes'!$D$3:$D$2103,'airport codes'!$C$3:$C$2103)","v":"Belgium"},"21DEC20",2145,740,"21DEC20","X",null,null,null,null,null,null,"PAXULD"]
[831,"Brussels Airlines","SN291","ACC",{"$f":"_xlfn.XLOOKUP(' Flight data base'!D832,'airport codes'!$D$3:$D$2103,'airport codes'!$C$3:$C$2103)","v":"Ghana"},"ABJ",{"$f":"_xlfn.XLOOKUP(' Flight data base'!F832,'airport codes'!$D$3:$D$2103,'airport codes'!$C$3:$C$2103)","v":"Cote d'Ivoire"},"28DEC20",2145,2250,"28DEC20","X",null,null,null,null,null,null,"PAXULD"]
[832,"Brussels Airlines","SN291","ABJ",{"$f":"_xlfn.XLOOKUP(' Flight data base'!D833,'airport codes'!$D$3:$D$2103,'airport codes'!$C$3:$C$2103)","v":"Cote d'Ivoire"},"BRU",{"$f":"_xlfn.XLOOKUP(' Flight data base'!F833,'airport codes'!$D$3:$D$2103,'airport codes'!$C$3:$C$2103)","v":"Belgium"},"28DEC20",2355,740,"28DEC20","X",null,null,null,null,null,null,"PAXULD"]
[833,"Brussels Airlines","SN291","ACC",{"$f":"_xlfn.XLOOKUP(' Flight data base'!D834,'airport codes'!$D$3:$D$2103,'airport codes'!$C$3:$C$2103)","v":"Ghana"},"BRU",{"$f":"_xlfn.XLOOKUP(' Flight data base'!F834,'airport codes'!$D$3:$D$2103,'airport codes'!$C$3:$C$2103)","v":"Belgium"},"28DEC20",2145,740,"28DEC20","X",null,null,null,null,null,null,"PAXULD"]
[834,"Brussels Airlines","SN358","FIH",{"$f":"_xlfn.XLOOKUP(' Flight data base'!D835,'airport codes'!$D$3:$D$2103,'airport codes'!$C$3:$C$2103)","v":"Congo (DRC)"},"BRU",{"$f":"_xlfn.XLOOKUP(' Flight data base'!F835,'airport codes'!$D$3:$D$2103,'airport codes'!$C$3:$C$2103)","v":"Belgium"},"23DEC20",2225,640,"23DEC20",null,null,"X",null,null,null,null,"PAXULD"]
[835,"Brussels Airlines","SN358","FIH",{"$f":"_xlfn.XLOOKUP(' Flight data base'!D836,'airport codes'!$D$3:$D$2103,'airport codes'!$C$3:$C$2103)","v":"Congo (DRC)"},"BRU",{"$f":"_xlfn.XLOOKUP(' Flight data base'!F836,'airport codes'!$D$3:$D$2103,'airport codes'!$C$3:$C$2103)","v":"Belgium"},"27DEC20",2225,640,"27DEC20",null,null,null,null,null,null,"X","PAXULD"]
[836,"Brussels Airlines","SN358","FIH",{"$f":"_xlfn.XLOOKUP(' Flight data base'!D837,'airport codes'!$D$3:$D$2103,'airport codes'!$C$3:$C$2103)","v":"Congo (DRC)"},"BRU",{"$f":"_xlfn.XLOOKUP(' Flight data base'!F837,'airport codes'!$D$3:$D$2103,'airport codes'!$C$3:$C$2103)","v":"Belgium"},"29DEC20",2225,640,"29DEC20",null,"X",null,null,null,null,null,"PAXULD"]
[837,"Brussels Airlines","SN358","FIH",{"$f":"_xlfn.XLOOKUP(' Flight data base'!D838,'airport codes'!$D$3:$D$2103,'airport codes'!$C$3:$C$2103)","v":"Congo (DRC)"},"BRU",{"$f":"_xlfn.XLOOKUP(' Flight data base'!F838,'airport codes'!$D$3:$D$2103,'airport codes'!$C$3:$C$2103)","v":"Belgium"},"2021-01-02",2225,640,"2021-01-09","X",null,null,null,null,"X",null,"PAXULD"]
[838,"Brussels Airlines","SN358","FIH",{"$f":"_xlfn.XLOOKUP(' Flight data base'!D839,'airport codes'!$D$3:$D$2103,'airport codes'!$C$3:$C$2103)","v":"Congo (DRC)"},"BRU",{"$f":"_xlfn.XLOOKUP(' Flight data base'!F839,'airport codes'!$D$3:$D$2103,'airport codes'!$C$3:$C$2103)","v":"Belgium"},"2021-01-03",2225,640,"2021-01-03",null,null,null,null,null,null,"X","PAXULD"]
[839,"Brussels Airlines","SN358","FIH",{"$f":"_xlfn.XLOOKUP(' Flight data base'!D840,'airport codes'!$D$3:$D$2103,'airport codes'!$C$3:$C$2103)","v":"Congo (DRC)"},"BRU",{"$f":"_xlfn.XLOOKUP(' Flight data base'!F840,'airport codes'!$D$3:$D$2103,'airport codes'!$C$3:$C$2103)","v":"Belgium"},"2021-01-05",2225,640,"2021-01-07",null,"X",null,"X",null,null,null,"PAXULD"]
[840,"Brussels Airlines","SN358","FIH",{"$f":"_xlfn.XLOOKUP(' Flight data base'!D841,'airport codes'!$D$3:$D$2103,'airport codes'!$C$3:$C$2103)","v":"Congo (DRC)"},"BRU",{"$f":"_xlfn.XLOOKUP(' Flight data base'!F841,'airport codes'!$D$3:$D$2103,'airport codes'!$C$3:$C$2103)","v":"Belgium"},"2021-01-06",2225,640,"2021-01-06",null,null,"X",null,null,null,null,"PAXULD"]
[841,"Brussels Airlines","SN358","FIH",{"$f":"_xlfn.XLOOKUP(' Flight data base'!D842,'airport codes'!$D$3:$D$2103,'airport codes'!$C$3:$C$2103)","v":"Congo (DRC)"},"BRU",{"$f":"_xlfn.XLOOKUP(' Flight data base'!F842,'airport codes'!$D$3:$D$2103,'airport codes'!$C$3:$C$2103)","v":"Belgium"},"15DEC20",2225,640,"15DEC20",null,"X",null,null,null,null,null,"PAXULD"]
[842,"Brussels Airlines","SN358","FIH",{"$f":"_xlfn.XLOOKUP(' Flight data base'!D843,'airport codes'!$D$3:$D$2103,'airport codes'!$C$3:$C$2103)","v":"Congo (DRC)"},"BRU",{"$f":"_xlfn.XLOOKUP(' Flight data base'!F843,'airport codes'!$D$3:$D$2103,'airport codes'!$C$3:$C$2103)","v":"Belgium"},"2021-01-08",2225,640,"2021-01-10",null,null,null,null,"X",null,"X","PAXULD"]
[843,"Brussels Airlines","SN358","FIH",{"$f":"_xlfn.XLOOKUP(' Flight data base'!D844,'airport codes'!$D$3:$D$2103,'airport codes'!$C$3:$C$2103)","v":"Congo (DRC)"},"BRU",{"$f":"_xlfn.XLOOKUP(' Flight data base'!F844,'airport codes'!$D$3:$D$2103,'airport codes'!$C$3:$C$2103)","v":"Belgium"},"17DEC20",2225,640,"17DEC20",null,null,null,"X",null,null,null,"PAXULD"]
[844,"Brussels Airlines","SN358","FIH",{"$f":"_xlfn.XLOOKUP(' Flight data base'!D845,'airport codes'!$D$3:$D$2103,'airport codes'!$C$3:$C$2103)","v":"Congo (DRC)"},"BRU",{"$f":"_xlfn.XLOOKUP(' Flight data base'!F845,'airport codes'!$D$3:$D$2103,'airport codes'!$C$3:$C$2103)","v":"Belgium"},"22DEC20",2225,640,"22DEC20",null,"X",null,null,null,null,null,"PAXULD"]
[845,"Brussels Airlines","SN358","FIH",{"$f":"_xlfn.XLOOKUP(' Flight data base'!D846,'airport codes'!$D$3:$D$2103,'airport codes'!$C$3:$C$2103)","v":"Congo (DRC)"},"BRU",{"$f":"_xlfn.XLOOKUP(' Flight data base'!F846,'airport codes'!$D$3:$D$2103,'airport codes'!$C$3:$C$2103)","v":"Belgium"},"18DEC20",2225,640,"18DEC20",null,null,null,null,"X",null,null,"PAXULD"]
[846,"Brussels Airlines","SN358","FIH",{"$f":"_xlfn.XLOOKUP(' Flight data base'!D847,'airport codes'!$D$3:$D$2103,'airport codes'!$C$3:$C$2103)","v":"Congo (DRC)"},"BRU",{"$f":"_xlfn.XLOOKUP(' Flight data base'!F847,'airport codes'!$D$3:$D$2103,'airport codes'!$C$3:$C$2103)","v":"Belgium"},"2021-01-12",2225,640,"2021-01-14",null,"X",null,"X",null,null,null,"PAXULD"]
[847,"Brussels Airlines","SN358","FIH",{"$f":"_xlfn.XLOOKUP(' Flight data base'!D848,'airport codes'!$D$3:$D$2103,'airport codes'!$C$3:$C$2103)","v":"Congo (DRC)"},"BRU",{"$f":"_xlfn.XLOOKUP(' Flight data base'!F848,'airport codes'!$D$3:$D$2103,'airport codes'!$C$3:$C$2103)","v":"Belgium"},"20DEC20",2225,640,"20DEC20",null,null,null,null,null,null,"X","PAXULD"]
[848,"Brussels Airlines","SN358","FIH",{"$f":"_xlfn.XLOOKUP(' Flight data base'!D849,'airport codes'!$D$3:$D$2103,'airport codes'!$C$3:$C$2103)","v":"Congo (DRC)"},"BRU",{"$f":"_xlfn.XLOOKUP(' Flight data base'!F849,'airport codes'!$D$3:$D$2103,'airport codes'!$C$3:$C$2103)","v":"Belgium"},"2021-01-13",2225,640,"2021-01-13",null,null,"X",null,null,null,null,"PAXULD"]
[849,"Brussels Airlines","SN358","FIH",{"$f":"_xlfn.XLOOKUP(' Flight data base'!D850,'airport codes'!$D$3:$D$2103,'airport codes'!$C$3:$C$2103)","v":"Congo (DRC)"},"BRU",{"$f":"_xlfn.XLOOKUP(' Flight data base'!F850,'airport codes'!$D$3:$D$2103,'airport codes'!$C$3:$C$2103)","v":"Belgium"},"21DEC20",2225,640,"21DEC20","X",null,null,null,null,null,null,"PAXULD"]
[850,"Brussels Airlines","SN358","FIH",{"$f":"_xlfn.XLOOKUP(' Flight data base'!D851,'airport codes'!$D$3:$D$2103,'airport codes'!$C$3:$C$2103)","v":"Congo (DRC)"},"BRU",{"$f":"_xlfn.XLOOKUP(' Flight data base'!F851,'airport codes'!$D$3:$D$2103,'airport codes'!$C$3:$C$2103)","v":"Belgium"},"19DEC20",2225,640,"19DEC20",null,null,null,null,null,"X",null,"PAXULD"]
[851,"Brussels Airlines","SN371","DLA",{"$f":"_xlfn.XLOOKUP(' Flight data base'!D852,'airport codes'!$D$3:$D$2103,'airport codes'!$C$3:$C$2103)","v":"Cameroon"},"NSI",{"$f":"_xlfn.XLOOKUP(' Flight data base'!F852,'airport codes'!$D$3:$D$2103,'airport codes'!$C$3:$C$2103)","v":"Cameroon"},"15DEC20",2245,2335,"15DEC20",null,"X",null,null,null,null,null,"PAXULD"]
[852,"Brussels Airlines","SN371","DLA",{"$f":"_xlfn.XLOOKUP(' Flight data base'!D853,'airport codes'!$D$3:$D$2103,'airport codes'!$C$3:$C$2103)","v":"Cameroon"},"NSI",{"$f":"_xlfn.XLOOKUP(' Flight data base'!F853,'airport codes'!$D$3:$D$2103,'airport codes'!$C$3:$C$2103)","v":"Cameroon"},"17DEC20",2245,2335,"17DEC20",null,null,null,"X",null,null,null,"PAXULD"]
[853,"Brussels Airlines","SN371","DLA",{"$f":"_xlfn.XLOOKUP(' Flight data base'!D854,'airport codes'!$D$3:$D$2103,'airport codes'!$C$3:$C$2103)","v":"Cameroon"},"NSI",{"$f":"_xlfn.XLOOKUP(' Flight data base'!F854,'airport codes'!$D$3:$D$2103,'airport codes'!$C$3:$C$2103)","v":"Cameroon"},"24DEC20",2245,2335,"11FEB21",null,null,null,"X",null,null,null,"PAXULD"]
[854,"Brussels Airlines","SN371","DLA",{"$f":"_xlfn.XLOOKUP(' Flight data base'!D855,'airport codes'!$D$3:$D$2103,'airport codes'!$C$3:$C$2103)","v":"Cameroon"},"NSI",{"$f":"_xlfn.XLOOKUP(' Flight data base'!F855,'airport codes'!$D$3:$D$2103,'airport codes'!$C$3:$C$2103)","v":"Cameroon"},"19DEC20",2245,2335,"19DEC20",null,null,null,null,null,"X",null,"PAXULD"]
[855,"Brussels Airlines","SN371","DLA",{"$f":"_xlfn.XLOOKUP(' Flight data base'!D856,'airport codes'!$D$3:$D$2103,'airport codes'!$C$3:$C$2103)","v":"Cameroon"},"NSI",{"$f":"_xlfn.XLOOKUP(' Flight data base'!F856,'airport codes'!$D$3:$D$2103,'airport codes'!$C$3:$C$2103)","v":"Cameroon"},"22DEC20",2245,2335,"13FEB21",null,"X",null,null,null,"X",null,"PAXULD"]
[856,"Brussels Airlines","SN372","NSI",{"$f":"_xlfn.XLOOKUP(' Flight data base'!D857,'airport codes'!$D$3:$D$2103,'airport codes'!$C$3:$C$2103)","v":"Cameroon"},"BRU",{"$f":"_xlfn.XLOOKUP(' Flight data base'!F857,'airport codes'!$D$3:$D$2103,'airport codes'!$C$3:$C$2103)","v":"Belgium"},"23DEC20",2150,635,"10FEB21",null,null,"X",null,null,null,null,"PAXULD"]
[857,"Brussels Airlines","SN372","NSI",{"$f":"_xlfn.XLOOKUP(' Flight data base'!D858,'airport codes'!$D$3:$D$2103,'airport codes'!$C$3:$C$2103)","v":"Cameroon"},"DLA",{"$f":"_xlfn.XLOOKUP(' Flight data base'!F858,'airport codes'!$D$3:$D$2103,'airport codes'!$C$3:$C$2103)","v":"Cameroon"},"23DEC20",2150,2235,"10FEB21",null,null,"X",null,null,null,null,"PAXULD"]
[858,"Brussels Airlines","SN372","DLA",{"$f":"_xlfn.XLOOKUP(' Flight data base'!D859,'airport codes'!$D$3:$D$2103,'airport codes'!$C$3:$C$2103)","v":"Cameroon"},"BRU",{"$f":"_xlfn.XLOOKUP(' Flight data base'!F859,'airport codes'!$D$3:$D$2103,'airport codes'!$C$3:$C$2103)","v":"Belgium"},"23DEC20",2340,635,"10FEB21",null,null,"X",null,null,null,null,"PAXULD"]
[859,"Brussels Airlines","SN372","NSI",{"$f":"_xlfn.XLOOKUP(' Flight data base'!D860,'airport codes'!$D$3:$D$2103,'airport codes'!$C$3:$C$2103)","v":"Cameroon"},"BRU",{"$f":"_xlfn.XLOOKUP(' Flight data base'!F860,'airport codes'!$D$3:$D$2103,'airport codes'!$C$3:$C$2103)","v":"Belgium"},"16DEC20",2150,635,"16DEC20",null,null,"X",null,null,null,null,"PAXULD"]
[860,"Brussels Airlines","SN372","NSI",{"$f":"_xlfn.XLOOKUP(' Flight data base'!D861,'airport codes'!$D$3:$D$2103,'airport codes'!$C$3:$C$2103)","v":"Cameroon"},"DLA",{"$f":"_xlfn.XLOOKUP(' Flight data base'!F861,'airport codes'!$D$3:$D$2103,'airport codes'!$C$3:$C$2103)","v":"Cameroon"},"16DEC20",2150,2235,"16DEC20",null,null,"X",null,null,null,null,"PAXULD"]
[861,"Brussels Airlines","SN372","DLA",{"$f":"_xlfn.XLOOKUP(' Flight data base'!D862,'airport codes'!$D$3:$D$2103,'airport codes'!$C$3:$C$2103)","v":"Cameroon"},"BRU",{"$f":"_xlfn.XLOOKUP(' Flight data base'!F862,'airport codes'!$D$3:$D$2103,'airport codes'!$C$3:$C$2103)","v":"Belgium"},"16DEC20",2340,635,"16DEC20",null,null,"X",null,null,null,null,"PAXULD"]
[862,"Brussels Airlines","SN372","NSI",{"$f":"_xlfn.XLOOKUP(' Flight data base'!D863,'airport codes'!$D$3:$D$2103,'airport codes'!$C$3:$C$2103)","v":"Cameroon"},"BRU",{"$f":"_xlfn.XLOOKUP(' Flight data base'!F863,'airport codes'!$D$3:$D$2103,'airport codes'!$C$3:$C$2103)","v":"Belgium"},"18DEC20",2150,635,"18DEC20",null,null,null,null,"X",null,null,"PAXULD"]
[863,"Brussels Airlines","SN372","NSI",{"$f":"_xlfn.XLOOKUP(' Flight data base'!D864,'airport codes'!$D$3:$D$2103,'airport codes'!$C$3:$C$2103)","v":"Cameroon"},"DLA",{"$f":"_xlfn.XLOOKUP(' Flight data base'!F864,'airport codes'!$D$3:$D$2103,'airport codes'!$C$3:$C$2103)","v":"Cameroon"},"18DEC20",2150,2235,"18DEC20",null,null,null,null,"X",null,null,"PAXULD"]
[864,"Brussels Airlines","SN372","DLA",{"$f":"_xlfn.XLOOKUP(' Flight data base'!D865,'airport codes'!$D$3:$D$2103,'airport codes'!$C$3:$C$2103)","v":"Cameroon"},"BRU",{"$f":"_xlfn.XLOOKUP(' Flight data base'!F865,'airport codes'!$D$3:$D$2103,'airport codes'!$C$3:$C$2103)","v":"Belgium"},"18DEC20",2340,635,"18DEC20",null,null,null,null,"X",null,null,"PAXULD"]
[865,"Brussels Airlines","SN372","NSI",{"$f":"_xlfn.XLOOKUP(' Flight data base'!D866,'airport codes'!$D$3:$D$2103,'airport codes'!$C$3:$C$2103)","v":"Cameroon"},"BRU",{"$f":"_xlfn.XLOOKUP(' Flight data base'!F866,'airport codes'!$D$3:$D$2103,'airport codes'!$C$3:$C$2103)","v":"Belgium"},"25DEC20",2150,635,"12FEB21",null,null,null,null,"X",null,null,"PAXULD"]
[866,"Brussels Airlines","SN372","NSI",{"$f":"_xlfn.XLOOKUP(' Flight data base'!D867,'airport codes'!$D$3:$D$2103,'airport codes'!$C$3:$C$2103)","v":"Cameroon"},"DLA",{"$f":"_xlfn.XLOOKUP(' Flight data base'!F867,'airport codes'!$D$3:$D$2103,'airport codes'!$C$3:$C$2103)","v":"Cameroon"},"25DEC20",2150,2235,"12FEB21",null,null,null,null,"X",null,null,"PAXULD"]
[867,"Brussels Airlines","SN372","DLA",{"$f":"_xlfn.XLOOKUP(' Flight data base'!D868,'airport codes'!$D$3:$D$2103,'airport codes'!$C$3:$C$2103)","v":"Cameroon"},"BRU",{"$f":"_xlfn.XLOOKUP(' Flight data base'!F868,'airport codes'!$D$3:$D$2103,'airport codes'!$C$3:$C$2103)","v":"Belgium"},"25DEC20",2340,635,"12FEB21",null,null,null,null,"X",null,null,"PAXULD"]
[868,"Brussels Airlines","SN372","NSI",{"$f":"_xlfn.XLOOKUP(' Flight data base'!D869,'airport codes'!$D$3:$D$2103,'airport codes'!$C$3:$C$2103)","v":"Cameroon"},"BRU",{"$f":"_xlfn.XLOOKUP(' Flight data base'!F869,'airport codes'!$D$3:$D$2103,'airport codes'!$C$3:$C$2103)","v":"Belgium"},"20DEC20",2150,635,"20DEC20",null,null,null,null,null,null,"X","PAXULD"]
[869,"Brussels Airlines","SN372","NSI",{"$f":"_xlfn.XLOOKUP(' Flight data base'!D870,'airport codes'!$D$3:$D$2103,'airport codes'!$C$3:$C$2103)","v":"Cameroon"},"DLA",{"$f":"_xlfn.XLOOKUP(' Flight data base'!F870,'airport codes'!$D$3:$D$2103,'airport codes'!$C$3:$C$2103)","v":"Cameroon"},"20DEC20",2150,2235,"20DEC20",null,null,null,null,null,null,"X","PAXULD"]
[870,"Brussels Airlines","SN372","DLA",{"$f":"_xlfn.XLOOKUP(' Flight data base'!D871,'airport codes'!$D$3:$D$2103,'airport codes'!$C$3:$C$2103)","v":"Cameroon"},"BRU",{"$f":"_xlfn.XLOOKUP(' Flight data base'!F871,'airport codes'!$D$3:$D$2103,'airport codes'!$C$3:$C$2103)","v":"Belgium"},"20DEC20",2340,635,"20DEC20",null,null,null,null,null,null,"X","PAXULD"]
[871,"Brussels Airlines","SN372","NSI",{"$f":"_xlfn.XLOOKUP(' Flight data base'!D872,'airport codes'!$D$3:$D$2103,'airport codes'!$C$3:$C$2103)","v":"Cameroon"},"BRU",{"$f":"_xlfn.XLOOKUP(' Flight data base'!F872,'airport codes'!$D$3:$D$2103,'airport codes'!$C$3:$C$2103)","v":"Belgium"},"27DEC20",2150,635,"14FEB21",null,null,null,null,null,null,"X","PAXULD"]
[872,"Brussels Airlines","SN372","NSI",{"$f":"_xlfn.XLOOKUP(' Flight data base'!D873,'airport codes'!$D$3:$D$2103,'airport codes'!$C$3:$C$2103)","v":"Cameroon"},"DLA",{"$f":"_xlfn.XLOOKUP(' Flight data base'!F873,'airport codes'!$D$3:$D$2103,'airport codes'!$C$3:$C$2103)","v":"Cameroon"},"27DEC20",2150,2235,"14FEB21",null,null,null,null,null,null,"X","PAXULD"]
[873,"Brussels Airlines","SN372","DLA",{"$f":"_xlfn.XLOOKUP(' Flight data base'!D874,'airport codes'!$D$3:$D$2103,'airport codes'!$C$3:$C$2103)","v":"Cameroon"},"BRU",{"$f":"_xlfn.XLOOKUP(' Flight data base'!F874,'airport codes'!$D$3:$D$2103,'airport codes'!$C$3:$C$2103)","v":"Belgium"},"27DEC20",2340,635,"14FEB21",null,null,null,null,null,null,"X","PAXULD"]
[874,"Brussels Airlines","SN385","NSI",{"$f":"_xlfn.XLOOKUP(' Flight data base'!D875,'airport codes'!$D$3:$D$2103,'airport codes'!$C$3:$C$2103)","v":"Cameroon"},"DLA",{"$f":"_xlfn.XLOOKUP(' Flight data base'!F875,'airport codes'!$D$3:$D$2103,'airport codes'!$C$3:$C$2103)","v":"Cameroon"},"21DEC20",2305,2350,"21DEC20","X",null,null,null,null,null,null,"PAXULD"]
[875,"Brussels Airlines","SN385","NSI",{"$f":"_xlfn.XLOOKUP(' Flight data base'!D876,'airport codes'!$D$3:$D$2103,'airport codes'!$C$3:$C$2103)","v":"Cameroon"},"DLA",{"$f":"_xlfn.XLOOKUP(' Flight data base'!F876,'airport codes'!$D$3:$D$2103,'airport codes'!$C$3:$C$2103)","v":"Cameroon"},"28DEC20",2305,2350,"2021-01-11","X",null,null,null,null,null,null,"PAXULD"]
[876,"Brussels Airlines","SN386","DLA",{"$f":"_xlfn.XLOOKUP(' Flight data base'!D877,'airport codes'!$D$3:$D$2103,'airport codes'!$C$3:$C$2103)","v":"Cameroon"},"BRU",{"$f":"_xlfn.XLOOKUP(' Flight data base'!F877,'airport codes'!$D$3:$D$2103,'airport codes'!$C$3:$C$2103)","v":"Belgium"},"15DEC20",2035,525,"15DEC20",null,"X",null,null,null,null,null,"PAXULD"]
[877,"Brussels Airlines","SN386","DLA",{"$f":"_xlfn.XLOOKUP(' Flight data base'!D878,'airport codes'!$D$3:$D$2103,'airport codes'!$C$3:$C$2103)","v":"Cameroon"},"NSI",{"$f":"_xlfn.XLOOKUP(' Flight data base'!F878,'airport codes'!$D$3:$D$2103,'airport codes'!$C$3:$C$2103)","v":"Cameroon"},"15DEC20",2035,2125,"15DEC20",null,"X",null,null,null,null,null,"PAXULD"]
[878,"Brussels Airlines","SN386","NSI",{"$f":"_xlfn.XLOOKUP(' Flight data base'!D879,'airport codes'!$D$3:$D$2103,'airport codes'!$C$3:$C$2103)","v":"Cameroon"},"BRU",{"$f":"_xlfn.XLOOKUP(' Flight data base'!F879,'airport codes'!$D$3:$D$2103,'airport codes'!$C$3:$C$2103)","v":"Belgium"},"15DEC20",2230,525,"15DEC20",null,"X",null,null,null,null,null,"PAXULD"]
[879,"Brussels Airlines","SN386","DLA",{"$f":"_xlfn.XLOOKUP(' Flight data base'!D880,'airport codes'!$D$3:$D$2103,'airport codes'!$C$3:$C$2103)","v":"Cameroon"},"BRU",{"$f":"_xlfn.XLOOKUP(' Flight data base'!F880,'airport codes'!$D$3:$D$2103,'airport codes'!$C$3:$C$2103)","v":"Belgium"},"22DEC20",2035,525,"2021-01-12",null,"X",null,null,null,null,null,"PAXULD"]
[880,"Brussels Airlines","SN386","DLA",{"$f":"_xlfn.XLOOKUP(' Flight data base'!D881,'airport codes'!$D$3:$D$2103,'airport codes'!$C$3:$C$2103)","v":"Cameroon"},"NSI",{"$f":"_xlfn.XLOOKUP(' Flight data base'!F881,'airport codes'!$D$3:$D$2103,'airport codes'!$C$3:$C$2103)","v":"Cameroon"},"22DEC20",2035,2125,"2021-01-12",null,"X",null,null,null,null,null,"PAXULD"]
[881,"Brussels Airlines","SN386","NSI",{"$f":"_xlfn.XLOOKUP(' Flight data base'!D882,'airport codes'!$D$3:$D$2103,'airport codes'!$C$3:$C$2103)","v":"Cameroon"},"BRU",{"$f":"_xlfn.XLOOKUP(' Flight data base'!F882,'airport codes'!$D$3:$D$2103,'airport codes'!$C$3:$C$2103)","v":"Belgium"},"22DEC20",2230,525,"2021-01-12",null,"X",null,null,null,null,null,"PAXULD"]
[882,"Brussels Airlines","SN459","EBB",{"$f":"_xlfn.XLOOKUP(' Flight data base'!D883,'airport codes'!$D$3:$D$2103,'airport codes'!$C$3:$C$2103)","v":"Uganda"},"BJM",{"$f":"_xlfn.XLOOKUP(' Flight data base'!F883,'airport codes'!$D$3:$D$2103,'airport codes'!$C$3:$C$2103)","v":"Burundi"},"15DEC20",155,210,"15DEC20",null,"X",null,null,null,null,null,"PAXULD"]
[883,"Brussels Airlines","SN459","EBB",{"$f":"_xlfn.XLOOKUP(' Flight data base'!D884,'airport codes'!$D$3:$D$2103,'airport codes'!$C$3:$C$2103)","v":"Uganda"},"BJM",{"$f":"_xlfn.XLOOKUP(' Flight data base'!F884,'airport codes'!$D$3:$D$2103,'airport codes'!$C$3:$C$2103)","v":"Burundi"},"22DEC20",155,210,"29DEC20",null,"X",null,null,null,null,null,"PAXULD"]
[884,"Brussels Airlines","SN459","EBB",{"$f":"_xlfn.XLOOKUP(' Flight data base'!D885,'airport codes'!$D$3:$D$2103,'airport codes'!$C$3:$C$2103)","v":"Uganda"},"BJM",{"$f":"_xlfn.XLOOKUP(' Flight data base'!F885,'airport codes'!$D$3:$D$2103,'airport codes'!$C$3:$C$2103)","v":"Burundi"},"2021-01-11",155,205,"2021-03-22","X",null,null,null,null,null,null,"PAXULD"]
[885,"Brussels Airlines","SN460","BJM",{"$f":"_xlfn.XLOOKUP(' Flight data base'!D886,'airport codes'!$D$3:$D$2103,'airport codes'!$C$3:$C$2103)","v":"Burundi"},"BRU",{"$f":"_xlfn.XLOOKUP(' Flight data base'!F886,'airport codes'!$D$3:$D$2103,'airport codes'!$C$3:$C$2103)","v":"Belgium"},"16DEC20",2205,755,"16DEC20",null,null,"X",null,null,null,null,"PAXULD"]
[886,"Brussels Airlines","SN460","BJM",{"$f":"_xlfn.XLOOKUP(' Flight data base'!D887,'airport codes'!$D$3:$D$2103,'airport codes'!$C$3:$C$2103)","v":"Burundi"},"EBB",{"$f":"_xlfn.XLOOKUP(' Flight data base'!F887,'airport codes'!$D$3:$D$2103,'airport codes'!$C$3:$C$2103)","v":"Uganda"},"16DEC20",2205,20,"16DEC20",null,null,"X",null,null,null,null,"PAXULD"]
[887,"Brussels Airlines","SN460","EBB",{"$f":"_xlfn.XLOOKUP(' Flight data base'!D888,'airport codes'!$D$3:$D$2103,'airport codes'!$C$3:$C$2103)","v":"Uganda"},"BRU",{"$f":"_xlfn.XLOOKUP(' Flight data base'!F888,'airport codes'!$D$3:$D$2103,'airport codes'!$C$3:$C$2103)","v":"Belgium"},"16DEC20",130,755,"16DEC20",null,null,"X",null,null,null,null,"PAXULD"]
[888,"Brussels Airlines","SN460","BJM",{"$f":"_xlfn.XLOOKUP(' Flight data base'!D889,'airport codes'!$D$3:$D$2103,'airport codes'!$C$3:$C$2103)","v":"Burundi"},"BRU",{"$f":"_xlfn.XLOOKUP(' Flight data base'!F889,'airport codes'!$D$3:$D$2103,'airport codes'!$C$3:$C$2103)","v":"Belgium"},"23DEC20",2205,755,"30DEC20",null,null,"X",null,null,null,null,"PAXULD"]
[889,"Brussels Airlines","SN460","BJM",{"$f":"_xlfn.XLOOKUP(' Flight data base'!D890,'airport codes'!$D$3:$D$2103,'airport codes'!$C$3:$C$2103)","v":"Burundi"},"EBB",{"$f":"_xlfn.XLOOKUP(' Flight data base'!F890,'airport codes'!$D$3:$D$2103,'airport codes'!$C$3:$C$2103)","v":"Uganda"},"23DEC20",2205,20,"30DEC20",null,null,"X",null,null,null,null,"PAXULD"]
[890,"Brussels Airlines","SN460","EBB",{"$f":"_xlfn.XLOOKUP(' Flight data base'!D891,'airport codes'!$D$3:$D$2103,'airport codes'!$C$3:$C$2103)","v":"Uganda"},"BRU",{"$f":"_xlfn.XLOOKUP(' Flight data base'!F891,'airport codes'!$D$3:$D$2103,'airport codes'!$C$3:$C$2103)","v":"Belgium"},"23DEC20",130,755,"30DEC20",null,null,"X",null,null,null,null,"PAXULD"]
[891,"Brussels Airlines","SN460","BJM",{"$f":"_xlfn.XLOOKUP(' Flight data base'!D892,'airport codes'!$D$3:$D$2103,'airport codes'!$C$3:$C$2103)","v":"Burundi"},"BRU",{"$f":"_xlfn.XLOOKUP(' Flight data base'!F892,'airport codes'!$D$3:$D$2103,'airport codes'!$C$3:$C$2103)","v":"Belgium"},"2021-01-13",2155,725,"2021-01-13",null,null,"X",null,null,null,null,"PAXULD"]
[892,"Brussels Airlines","SN460","BJM",{"$f":"_xlfn.XLOOKUP(' Flight data base'!D893,'airport codes'!$D$3:$D$2103,'airport codes'!$C$3:$C$2103)","v":"Burundi"},"EBB",{"$f":"_xlfn.XLOOKUP(' Flight data base'!F893,'airport codes'!$D$3:$D$2103,'airport codes'!$C$3:$C$2103)","v":"Uganda"},"2021-01-13",2155,5,"2021-01-13",null,null,"X",null,null,null,null,"PAXULD"]
[893,"Brussels Airlines","SN460","EBB",{"$f":"_xlfn.XLOOKUP(' Flight data base'!D894,'airport codes'!$D$3:$D$2103,'airport codes'!$C$3:$C$2103)","v":"Uganda"},"BRU",{"$f":"_xlfn.XLOOKUP(' Flight data base'!F894,'airport codes'!$D$3:$D$2103,'airport codes'!$C$3:$C$2103)","v":"Belgium"},"2021-01-13",100,725,"2021-01-13",null,null,"X",null,null,null,null,"PAXULD"]
[894,"Brussels Airlines","SN473","EBB",{"$f":"_xlfn.XLOOKUP(' Flight data base'!D895,'airport codes'!$D$3:$D$2103,'airport codes'!$C$3:$C$2103)","v":"Uganda"},"KGL",{"$f":"_xlfn.XLOOKUP(' Flight data base'!F895,'airport codes'!$D$3:$D$2103,'airport codes'!$C$3:$C$2103)","v":"Rwanda"},"22DEC20",200,155,"22DEC20",null,"X",null,null,null,null,null,"PAXULD"]
[895,"Brussels Airlines","SN473","EBB",{"$f":"_xlfn.XLOOKUP(' Flight data base'!D896,'airport codes'!$D$3:$D$2103,'airport codes'!$C$3:$C$2103)","v":"Uganda"},"KGL",{"$f":"_xlfn.XLOOKUP(' Flight data base'!F896,'airport codes'!$D$3:$D$2103,'airport codes'!$C$3:$C$2103)","v":"Rwanda"},"2021-01-05",200,155,"2021-01-05",null,"X",null,null,null,null,null,"PAXULD"]
[896,"Brussels Airlines","SN473","EBB",{"$f":"_xlfn.XLOOKUP(' Flight data base'!D897,'airport codes'!$D$3:$D$2103,'airport codes'!$C$3:$C$2103)","v":"Uganda"},"KGL",{"$f":"_xlfn.XLOOKUP(' Flight data base'!F897,'airport codes'!$D$3:$D$2103,'airport codes'!$C$3:$C$2103)","v":"Rwanda"},"2021-01-02",155,150,"2021-01-09",null,null,null,null,null,"X",null,"PAXULD"]
[897,"Brussels Airlines","SN473","EBB",{"$f":"_xlfn.XLOOKUP(' Flight data base'!D898,'airport codes'!$D$3:$D$2103,'airport codes'!$C$3:$C$2103)","v":"Uganda"},"KGL",{"$f":"_xlfn.XLOOKUP(' Flight data base'!F898,'airport codes'!$D$3:$D$2103,'airport codes'!$C$3:$C$2103)","v":"Rwanda"},"2021-01-07",155,150,"2021-01-14",null,null,null,"X",null,null,null,"PAXULD"]
[898,"Brussels Airlines","SN473","EBB",{"$f":"_xlfn.XLOOKUP(' Flight data base'!D899,'airport codes'!$D$3:$D$2103,'airport codes'!$C$3:$C$2103)","v":"Uganda"},"KGL",{"$f":"_xlfn.XLOOKUP(' Flight data base'!F899,'airport codes'!$D$3:$D$2103,'airport codes'!$C$3:$C$2103)","v":"Rwanda"},"17DEC20",155,150,"17DEC20",null,null,null,"X",null,null,null,"PAXULD"]
[899,"Brussels Airlines","SN473","EBB",{"$f":"_xlfn.XLOOKUP(' Flight data base'!D900,'airport codes'!$D$3:$D$2103,'airport codes'!$C$3:$C$2103)","v":"Uganda"},"KGL",{"$f":"_xlfn.XLOOKUP(' Flight data base'!F900,'airport codes'!$D$3:$D$2103,'airport codes'!$C$3:$C$2103)","v":"Rwanda"},"24DEC20",155,150,"24DEC20",null,null,null,"X",null,null,null,"PAXULD"]
[900,"Brussels Airlines","SN473","EBB",{"$f":"_xlfn.XLOOKUP(' Flight data base'!D901,'airport codes'!$D$3:$D$2103,'airport codes'!$C$3:$C$2103)","v":"Uganda"},"KGL",{"$f":"_xlfn.XLOOKUP(' Flight data base'!F901,'airport codes'!$D$3:$D$2103,'airport codes'!$C$3:$C$2103)","v":"Rwanda"},"19DEC20",155,150,"19DEC20",null,null,null,null,null,"X",null,"PAXULD"]
[901,"Brussels Airlines","SN473","EBB",{"$f":"_xlfn.XLOOKUP(' Flight data base'!D902,'airport codes'!$D$3:$D$2103,'airport codes'!$C$3:$C$2103)","v":"Uganda"},"KGL",{"$f":"_xlfn.XLOOKUP(' Flight data base'!F902,'airport codes'!$D$3:$D$2103,'airport codes'!$C$3:$C$2103)","v":"Rwanda"},"26DEC20",155,150,"26DEC20",null,null,null,null,null,"X",null,"PAXULD"]
[902,"Brussels Airlines","SN474","KGL",{"$f":"_xlfn.XLOOKUP(' Flight data base'!D903,'airport codes'!$D$3:$D$2103,'airport codes'!$C$3:$C$2103)","v":"Rwanda"},"BRU",{"$f":"_xlfn.XLOOKUP(' Flight data base'!F903,'airport codes'!$D$3:$D$2103,'airport codes'!$C$3:$C$2103)","v":"Belgium"},"23DEC20",2045,630,"23DEC20",null,null,"X",null,null,null,null,"PAXULD"]
[903,"Brussels Airlines","SN474","KGL",{"$f":"_xlfn.XLOOKUP(' Flight data base'!D904,'airport codes'!$D$3:$D$2103,'airport codes'!$C$3:$C$2103)","v":"Rwanda"},"EBB",{"$f":"_xlfn.XLOOKUP(' Flight data base'!F904,'airport codes'!$D$3:$D$2103,'airport codes'!$C$3:$C$2103)","v":"Uganda"},"23DEC20",2045,2250,"23DEC20",null,null,"X",null,null,null,null,"PAXULD"]
[904,"Brussels Airlines","SN474","EBB",{"$f":"_xlfn.XLOOKUP(' Flight data base'!D905,'airport codes'!$D$3:$D$2103,'airport codes'!$C$3:$C$2103)","v":"Uganda"},"BRU",{"$f":"_xlfn.XLOOKUP(' Flight data base'!F905,'airport codes'!$D$3:$D$2103,'airport codes'!$C$3:$C$2103)","v":"Belgium"},"23DEC20",2359,630,"23DEC20",null,null,"X",null,null,null,null,"PAXULD"]
[905,"Brussels Airlines","SN474","KGL",{"$f":"_xlfn.XLOOKUP(' Flight data base'!D906,'airport codes'!$D$3:$D$2103,'airport codes'!$C$3:$C$2103)","v":"Rwanda"},"BRU",{"$f":"_xlfn.XLOOKUP(' Flight data base'!F906,'airport codes'!$D$3:$D$2103,'airport codes'!$C$3:$C$2103)","v":"Belgium"},"2021-01-06",2045,630,"2021-01-06",null,null,"X",null,null,null,null,"PAXULD"]
[906,"Brussels Airlines","SN474","KGL",{"$f":"_xlfn.XLOOKUP(' Flight data base'!D907,'airport codes'!$D$3:$D$2103,'airport codes'!$C$3:$C$2103)","v":"Rwanda"},"EBB",{"$f":"_xlfn.XLOOKUP(' Flight data base'!F907,'airport codes'!$D$3:$D$2103,'airport codes'!$C$3:$C$2103)","v":"Uganda"},"2021-01-06",2045,2250,"2021-01-06",null,null,"X",null,null,null,null,"PAXULD"]
[907,"Brussels Airlines","SN474","EBB",{"$f":"_xlfn.XLOOKUP(' Flight data base'!D908,'airport codes'!$D$3:$D$2103,'airport codes'!$C$3:$C$2103)","v":"Uganda"},"BRU",{"$f":"_xlfn.XLOOKUP(' Flight data base'!F908,'airport codes'!$D$3:$D$2103,'airport codes'!$C$3:$C$2103)","v":"Belgium"},"2021-01-06",2359,630,"2021-01-06",null,null,"X",null,null,null,null,"PAXULD"]
[908,"Brussels Airlines","SN474","KGL",{"$f":"_xlfn.XLOOKUP(' Flight data base'!D909,'airport codes'!$D$3:$D$2103,'airport codes'!$C$3:$C$2103)","v":"Rwanda"},"BRU",{"$f":"_xlfn.XLOOKUP(' Flight data base'!F909,'airport codes'!$D$3:$D$2103,'airport codes'!$C$3:$C$2103)","v":"Belgium"},"2021-01-03",2145,725,"2021-01-03",null,null,null,null,null,null,"X","PAXULD"]
[909,"Brussels Airlines","SN474","KGL",{"$f":"_xlfn.XLOOKUP(' Flight data base'!D910,'airport codes'!$D$3:$D$2103,'airport codes'!$C$3:$C$2103)","v":"Rwanda"},"EBB",{"$f":"_xlfn.XLOOKUP(' Flight data base'!F910,'airport codes'!$D$3:$D$2103,'airport codes'!$C$3:$C$2103)","v":"Uganda"},"2021-01-03",2145,2350,"2021-01-03",null,null,null,null,null,null,"X","PAXULD"]
[910,"Brussels Airlines","SN474","EBB",{"$f":"_xlfn.XLOOKUP(' Flight data base'!D911,'airport codes'!$D$3:$D$2103,'airport codes'!$C$3:$C$2103)","v":"Uganda"},"BRU",{"$f":"_xlfn.XLOOKUP(' Flight data base'!F911,'airport codes'!$D$3:$D$2103,'airport codes'!$C$3:$C$2103)","v":"Belgium"},"2021-01-03",100,725,"2021-01-03",null,null,null,null,null,null,"X","PAXULD"]
[911,"Brussels Airlines","SN474","KGL",{"$f":"_xlfn.XLOOKUP(' Flight data base'!D912,'airport codes'!$D$3:$D$2103,'airport codes'!$C$3:$C$2103)","v":"Rwanda"},"BRU",{"$f":"_xlfn.XLOOKUP(' Flight data base'!F912,'airport codes'!$D$3:$D$2103,'airport codes'!$C$3:$C$2103)","v":"Belgium"},"2021-01-08",2145,725,"2021-01-15",null,null,null,null,"X",null,null,"PAXULD"]
[912,"Brussels Airlines","SN474","KGL",{"$f":"_xlfn.XLOOKUP(' Flight data base'!D913,'airport codes'!$D$3:$D$2103,'airport codes'!$C$3:$C$2103)","v":"Rwanda"},"EBB",{"$f":"_xlfn.XLOOKUP(' Flight data base'!F913,'airport codes'!$D$3:$D$2103,'airport codes'!$C$3:$C$2103)","v":"Uganda"},"2021-01-08",2145,2350,"2021-01-15",null,null,null,null,"X",null,null,"PAXULD"]
[913,"Brussels Airlines","SN474","EBB",{"$f":"_xlfn.XLOOKUP(' Flight data base'!D914,'airport codes'!$D$3:$D$2103,'airport codes'!$C$3:$C$2103)","v":"Uganda"},"BRU",{"$f":"_xlfn.XLOOKUP(' Flight data base'!F914,'airport codes'!$D$3:$D$2103,'airport codes'!$C$3:$C$2103)","v":"Belgium"},"2021-01-08",100,725,"2021-01-15",null,null,null,null,"X",null,null,"PAXULD"]
[914,"Brussels Airlines","SN474","KGL",{"$f":"_xlfn.XLOOKUP(' Flight data base'!D915,'airport codes'!$D$3:$D$2103,'airport codes'!$C$3:$C$2103)","v":"Rwanda"},"BRU",{"$f":"_xlfn.XLOOKUP(' Flight data base'!F915,'airport codes'!$D$3:$D$2103,'airport codes'!$C$3:$C$2103)","v":"Belgium"},"2021-01-10",2145,725,"2021-01-10",null,null,null,null,null,null,"X","PAXULD"]
[915,"Brussels Airlines","SN474","KGL",{"$f":"_xlfn.XLOOKUP(' Flight data base'!D916,'airport codes'!$D$3:$D$2103,'airport codes'!$C$3:$C$2103)","v":"Rwanda"},"EBB",{"$f":"_xlfn.XLOOKUP(' Flight data base'!F916,'airport codes'!$D$3:$D$2103,'airport codes'!$C$3:$C$2103)","v":"Uganda"},"2021-01-10",2145,2350,"2021-01-10",null,null,null,null,null,null,"X","PAXULD"]
[916,"Brussels Airlines","SN474","EBB",{"$f":"_xlfn.XLOOKUP(' Flight data base'!D917,'airport codes'!$D$3:$D$2103,'airport codes'!$C$3:$C$2103)","v":"Uganda"},"BRU",{"$f":"_xlfn.XLOOKUP(' Flight data base'!F917,'airport codes'!$D$3:$D$2103,'airport codes'!$C$3:$C$2103)","v":"Belgium"},"2021-01-10",100,725,"2021-01-10",null,null,null,null,null,null,"X","PAXULD"]
[917,"Brussels Airlines","SN474","KGL",{"$f":"_xlfn.XLOOKUP(' Flight data base'!D918,'airport codes'!$D$3:$D$2103,'airport codes'!$C$3:$C$2103)","v":"Rwanda"},"BRU",{"$f":"_xlfn.XLOOKUP(' Flight data base'!F918,'airport codes'!$D$3:$D$2103,'airport codes'!$C$3:$C$2103)","v":"Belgium"},"18DEC20",2145,725,"18DEC20",null,null,null,null,"X",null,null,"PAXULD"]
[918,"Brussels Airlines","SN474","KGL",{"$f":"_xlfn.XLOOKUP(' Flight data base'!D919,'airport codes'!$D$3:$D$2103,'airport codes'!$C$3:$C$2103)","v":"Rwanda"},"EBB",{"$f":"_xlfn.XLOOKUP(' Flight data base'!F919,'airport codes'!$D$3:$D$2103,'airport codes'!$C$3:$C$2103)","v":"Uganda"},"18DEC20",2145,2350,"18DEC20",null,null,null,null,"X",null,null,"PAXULD"]
[919,"Brussels Airlines","SN474","EBB",{"$f":"_xlfn.XLOOKUP(' Flight data base'!D920,'airport codes'!$D$3:$D$2103,'airport codes'!$C$3:$C$2103)","v":"Uganda"},"BRU",{"$f":"_xlfn.XLOOKUP(' Flight data base'!F920,'airport codes'!$D$3:$D$2103,'airport codes'!$C$3:$C$2103)","v":"Belgium"},"18DEC20",100,725,"18DEC20",null,null,null,null,"X",null,null,"PAXULD"]
[920,"Brussels Airlines","SN474","KGL",{"$f":"_xlfn.XLOOKUP(' Flight data base'!D921,'airport codes'!$D$3:$D$2103,'airport codes'!$C$3:$C$2103)","v":"Rwanda"},"BRU",{"$f":"_xlfn.XLOOKUP(' Flight data base'!F921,'airport codes'!$D$3:$D$2103,'airport codes'!$C$3:$C$2103)","v":"Belgium"},"25DEC20",2145,725,"25DEC20",null,null,null,null,"X",null,null,"PAXULD"]
[921,"Brussels Airlines","SN474","KGL",{"$f":"_xlfn.XLOOKUP(' Flight data base'!D922,'airport codes'!$D$3:$D$2103,'airport codes'!$C$3:$C$2103)","v":"Rwanda"},"EBB",{"$f":"_xlfn.XLOOKUP(' Flight data base'!F922,'airport codes'!$D$3:$D$2103,'airport codes'!$C$3:$C$2103)","v":"Uganda"},"25DEC20",2145,2350,"25DEC20",null,null,null,null,"X",null,null,"PAXULD"]
[922,"Brussels Airlines","SN474","EBB",{"$f":"_xlfn.XLOOKUP(' Flight data base'!D923,'airport codes'!$D$3:$D$2103,'airport codes'!$C$3:$C$2103)","v":"Uganda"},"BRU",{"$f":"_xlfn.XLOOKUP(' Flight data base'!F923,'airport codes'!$D$3:$D$2103,'airport codes'!$C$3:$C$2103)","v":"Belgium"},"25DEC20",100,725,"25DEC20",null,null,null,null,"X",null,null,"PAXULD"]
[923,"Brussels Airlines","SN474","KGL",{"$f":"_xlfn.XLOOKUP(' Flight data base'!D924,'airport codes'!$D$3:$D$2103,'airport codes'!$C$3:$C$2103)","v":"Rwanda"},"BRU",{"$f":"_xlfn.XLOOKUP(' Flight data base'!F924,'airport codes'!$D$3:$D$2103,'airport codes'!$C$3:$C$2103)","v":"Belgium"},"20DEC20",2145,725,"20DEC20",null,null,null,null,null,null,"X","PAXULD"]
[924,"Brussels Airlines","SN474","KGL",{"$f":"_xlfn.XLOOKUP(' Flight data base'!D925,'airport codes'!$D$3:$D$2103,'airport codes'!$C$3:$C$2103)","v":"Rwanda"},"EBB",{"$f":"_xlfn.XLOOKUP(' Flight data base'!F925,'airport codes'!$D$3:$D$2103,'airport codes'!$C$3:$C$2103)","v":"Uganda"},"20DEC20",2145,2350,"20DEC20",null,null,null,null,null,null,"X","PAXULD"]
[925,"Brussels Airlines","SN474","EBB",{"$f":"_xlfn.XLOOKUP(' Flight data base'!D926,'airport codes'!$D$3:$D$2103,'airport codes'!$C$3:$C$2103)","v":"Uganda"},"BRU",{"$f":"_xlfn.XLOOKUP(' Flight data base'!F926,'airport codes'!$D$3:$D$2103,'airport codes'!$C$3:$C$2103)","v":"Belgium"},"20DEC20",100,725,"20DEC20",null,null,null,null,null,null,"X","PAXULD"]
[926,"Brussels Airlines","SN474","KGL",{"$f":"_xlfn.XLOOKUP(' Flight data base'!D927,'airport codes'!$D$3:$D$2103,'airport codes'!$C$3:$C$2103)","v":"Rwanda"},"BRU",{"$f":"_xlfn.XLOOKUP(' Flight data base'!F927,'airport codes'!$D$3:$D$2103,'airport codes'!$C$3:$C$2103)","v":"Belgium"},"27DEC20",2145,725,"27DEC20",null,null,null,null,null,null,"X","PAXULD"]
[927,"Brussels Airlines","SN474","KGL",{"$f":"_xlfn.XLOOKUP(' Flight data base'!D928,'airport codes'!$D$3:$D$2103,'airport codes'!$C$3:$C$2103)","v":"Rwanda"},"EBB",{"$f":"_xlfn.XLOOKUP(' Flight data base'!F928,'airport codes'!$D$3:$D$2103,'airport codes'!$C$3:$C$2103)","v":"Uganda"},"27DEC20",2145,2350,"27DEC20",null,null,null,null,null,null,"X","PAXULD"]
[928,"Brussels Airlines","SN474","EBB",{"$f":"_xlfn.XLOOKUP(' Flight data base'!D929,'airport codes'!$D$3:$D$2103,'airport codes'!$C$3:$C$2103)","v":"Uganda"},"BRU",{"$f":"_xlfn.XLOOKUP(' Flight data base'!F929,'airport codes'!$D$3:$D$2103,'airport codes'!$C$3:$C$2103)","v":"Belgium"},"27DEC20",100,725,"27DEC20",null,null,null,null,null,null,"X","PAXULD"]
[929,"EMIRATES","EK785","DXB",{"$f":"_xlfn.XLOOKUP(' Flight data base'!D930,'airport codes'!$D$3:$D$2103,'airport codes'!$C$3:$C$2103)","v":"United Arab Emirates"},"ABV",{"$f":"_xlfn.XLOOKUP(' Flight data base'!F930,'airport codes'!$D$3:$D$2103,'airport codes'!$C$3:$C$2103)","v":"Nigeria"},"2020-12-09","1035","1515","2020-12-31","X","X","X","X","X","X","X","PO"]
[930,"EMIRATES","EK786","ABV",{"$f":"_xlfn.XLOOKUP(' Flight data base'!D931,'airport codes'!$D$3:$D$2103,'airport codes'!$C$3:$C$2103)","v":"Nigeria"},"DXB",{"$f":"_xlfn.XLOOKUP(' Flight data base'!F931,'airport codes'!$D$3:$D$2103,'airport codes'!$C$3:$C$2103)","v":"United Arab Emirates"},"2020-12-09","1910","0435","2020-12-31","X","X","X","X","X","X","X","PO"]
[931,"EMIRATES","EK 0787","DXB",{"$f":"_xlfn.XLOOKUP(' Flight data base'!D932,'airport codes'!$D$3:$D$2103,'airport codes'!$C$3:$C$2103)","v":"United Arab Emirates"},"ABV",{"$f":"_xlfn.XLOOKUP(' Flight data base'!F932,'airport codes'!$D$3:$D$2103,'airport codes'!$C$3:$C$2103)","v":"Nigeria"},"2020-12-09","0300","0730","2020-12-31",null,null,"X",null,"X",null,"X","PO"]
[932,"EMIRATES","EK 0787","ABV",{"$f":"_xlfn.XLOOKUP(' Flight data base'!D933,'airport codes'!$D$3:$D$2103,'airport codes'!$C$3:$C$2103)","v":"Nigeria"},"ACC",{"$f":"_xlfn.XLOOKUP(' Flight data base'!F933,'airport codes'!$D$3:$D$2103,'airport codes'!$C$3:$C$2103)","v":"Ghana"},"2020-12-09","0900","1000","2020-12-31",null,null,"X",null,"X",null,"X","PO"]
[933,"EMIRATES","EK 0787","ACC",{"$f":"_xlfn.XLOOKUP(' Flight data base'!D934,'airport codes'!$D$3:$D$2103,'airport codes'!$C$3:$C$2103)","v":"Ghana"},"ABJ",{"$f":"_xlfn.XLOOKUP(' Flight data base'!F934,'airport codes'!$D$3:$D$2103,'airport codes'!$C$3:$C$2103)","v":"Cote d'Ivoire"},"2020-12-09","1130","1235","2020-12-31",null,null,"X",null,"X",null,"X","PO"]
[934,"EMIRATES","EK 0788","ABJ",{"$f":"_xlfn.XLOOKUP(' Flight data base'!D935,'airport codes'!$D$3:$D$2103,'airport codes'!$C$3:$C$2103)","v":"Cote d'Ivoire"},"ACC",{"$f":"_xlfn.XLOOKUP(' Flight data base'!F935,'airport codes'!$D$3:$D$2103,'airport codes'!$C$3:$C$2103)","v":"Ghana"},"2020-12-09","1405","0135","2020-12-31",null,null,"X",null,"X",null,"X","PO"]
[935,"EMIRATES","EK723","DXB",{"$f":"_xlfn.XLOOKUP(' Flight data base'!D936,'airport codes'!$D$3:$D$2103,'airport codes'!$C$3:$C$2103)","v":"United Arab Emirates"},"ADD",{"$f":"_xlfn.XLOOKUP(' Flight data base'!F936,'airport codes'!$D$3:$D$2103,'airport codes'!$C$3:$C$2103)","v":"Ethiopia"},"2020-12-09","0925","1240","2020-12-31",null,"X",null,"X","X",null,"X","PO"]
[936,"EMIRATES","EK724","ADD",{"$f":"_xlfn.XLOOKUP(' Flight data base'!D937,'airport codes'!$D$3:$D$2103,'airport codes'!$C$3:$C$2103)","v":"Ethiopia"},"DXB",{"$f":"_xlfn.XLOOKUP(' Flight data base'!F937,'airport codes'!$D$3:$D$2103,'airport codes'!$C$3:$C$2103)","v":"United Arab Emirates"},"2020-12-09","1505","2015","2020-12-31",null,"X",null,"X","X",null,"X","PO"]
[937,"EMIRATES","EK795","DXB",{"$f":"_xlfn.XLOOKUP(' Flight data base'!D938,'airport codes'!$D$3:$D$2103,'airport codes'!$C$3:$C$2103)","v":"United Arab Emirates"},"CKY",{"$f":"_xlfn.XLOOKUP(' Flight data base'!F938,'airport codes'!$D$3:$D$2103,'airport codes'!$C$3:$C$2103)","v":"Guinea"},"2020-12-09","0930","1530","2020-12-31",null,null,null,null,null,null,"X","PO"]
[938,"EMIRATES","EK795","CKY",{"$f":"_xlfn.XLOOKUP(' Flight data base'!D939,'airport codes'!$D$3:$D$2103,'airport codes'!$C$3:$C$2103)","v":"Guinea"},"DSS",{"$f":"_xlfn.XLOOKUP(' Flight data base'!F939,'airport codes'!$D$3:$D$2103,'airport codes'!$C$3:$C$2103)","v":"Senegal"},"2020-12-09","1700","1825","2020-12-31",null,null,null,null,null,null,"X","PO"]
[939,"EMIRATES","EK795","DSS",{"$f":"_xlfn.XLOOKUP(' Flight data base'!D940,'airport codes'!$D$3:$D$2103,'airport codes'!$C$3:$C$2103)","v":"Senegal"},"DXB",{"$f":"_xlfn.XLOOKUP(' Flight data base'!F940,'airport codes'!$D$3:$D$2103,'airport codes'!$C$3:$C$2103)","v":"United Arab Emirates"},"2020-12-09","1225","0155","2020-12-31","X",null,null,null,null,null,null,"PO"]
[940,"EMIRATES","EK772","DXB",{"$f":"_xlfn.XLOOKUP(' Flight data base'!D941,'airport codes'!$D$3:$D$2103,'airport codes'!$C$3:$C$2103)","v":"United Arab Emirates"},"CPT",{"$f":"_xlfn.XLOOKUP(' Flight data base'!F941,'airport codes'!$D$3:$D$2103,'airport codes'!$C$3:$C$2103)","v":"South Africa"},"2020-12-09","0355","1140","2020-12-31",null,null,"X","X",null,"X","X","PO"]
[941,"EMIRATES","EK771","CPT",{"$f":"_xlfn.XLOOKUP(' Flight data base'!D942,'airport codes'!$D$3:$D$2103,'airport codes'!$C$3:$C$2103)","v":"South Africa"},"DXB",{"$f":"_xlfn.XLOOKUP(' Flight data base'!F942,'airport codes'!$D$3:$D$2103,'airport codes'!$C$3:$C$2103)","v":"United Arab Emirates"},"2020-12-09","1825","0555","2020-12-31",null,null,"X","X",null,"X","X","PO"]
[942,"EMIRATES","EK725","DXB",{"$f":"_xlfn.XLOOKUP(' Flight data base'!D943,'airport codes'!$D$3:$D$2103,'airport codes'!$C$3:$C$2103)","v":"United Arab Emirates"},"DAR",{"$f":"_xlfn.XLOOKUP(' Flight data base'!F943,'airport codes'!$D$3:$D$2103,'airport codes'!$C$3:$C$2103)","v":"Tanzania"},"2020-12-09","1015","1445","2020-12-31",null,"X",null,"X",null,"X",null,"PO"]
[943,"EMIRATES","EK726","DAR",{"$f":"_xlfn.XLOOKUP(' Flight data base'!D944,'airport codes'!$D$3:$D$2103,'airport codes'!$C$3:$C$2103)","v":"Tanzania"},"DXB",{"$f":"_xlfn.XLOOKUP(' Flight data base'!F944,'airport codes'!$D$3:$D$2103,'airport codes'!$C$3:$C$2103)","v":"United Arab Emirates"},"2020-12-09","1640","2305","2020-12-31",null,"X",null,"X",null,"X",null,"PO"]
[944,"EMIRATES","EK797","DXB",{"$f":"_xlfn.XLOOKUP(' Flight data base'!D945,'airport codes'!$D$3:$D$2103,'airport codes'!$C$3:$C$2103)","v":"United Arab Emirates"},"DSS",{"$f":"_xlfn.XLOOKUP(' Flight data base'!F945,'airport codes'!$D$3:$D$2103,'airport codes'!$C$3:$C$2103)","v":"Senegal"},"2020-12-09","1220","1855","2020-12-31","X",null,null,"X",null,null,null,"PO"]
[945,"EMIRATES","EK797","DSS",{"$f":"_xlfn.XLOOKUP(' Flight data base'!D946,'airport codes'!$D$3:$D$2103,'airport codes'!$C$3:$C$2103)","v":"Senegal"},"CKY",{"$f":"_xlfn.XLOOKUP(' Flight data base'!F946,'airport codes'!$D$3:$D$2103,'airport codes'!$C$3:$C$2103)","v":"Guinea"},"2020-12-09","1405","1530","2020-12-31",null,"X",null,null,"X",null,null,"PO"]
[946,"EMIRATES","EK797","CKY",{"$f":"_xlfn.XLOOKUP(' Flight data base'!D947,'airport codes'!$D$3:$D$2103,'airport codes'!$C$3:$C$2103)","v":"Guinea"},"DXB",{"$f":"_xlfn.XLOOKUP(' Flight data base'!F947,'airport codes'!$D$3:$D$2103,'airport codes'!$C$3:$C$2103)","v":"United Arab Emirates"},"2020-12-09","1710","0555","2020-12-31",null,"X",null,null,"X",null,null,"PO"]
[947,"EMIRATES","EK9742","DXB",{"$f":"_xlfn.XLOOKUP(' Flight data base'!D948,'airport codes'!$D$3:$D$2103,'airport codes'!$C$3:$C$2103)","v":"United Arab Emirates"},"DSS",{"$f":"_xlfn.XLOOKUP(' Flight data base'!F948,'airport codes'!$D$3:$D$2103,'airport codes'!$C$3:$C$2103)","v":"Senegal"},"2020-12-09","0505","1125","2020-12-31",null,null,null,"X",null,null,null,"PO"]
[948,"EMIRATES","EK9912","DSS",{"$f":"_xlfn.XLOOKUP(' Flight data base'!D949,'airport codes'!$D$3:$D$2103,'airport codes'!$C$3:$C$2103)","v":"Senegal"},"NBO",{"$f":"_xlfn.XLOOKUP(' Flight data base'!F949,'airport codes'!$D$3:$D$2103,'airport codes'!$C$3:$C$2103)","v":"Kenya"},"2020-12-09","1255","2330","2020-12-31",null,null,null,"X",null,null,null,"PO"]
[949,"EMIRATES","EK9755","NBO",{"$f":"_xlfn.XLOOKUP(' Flight data base'!D950,'airport codes'!$D$3:$D$2103,'airport codes'!$C$3:$C$2103)","v":"Kenya"},"AMS",{"$f":"_xlfn.XLOOKUP(' Flight data base'!F950,'airport codes'!$D$3:$D$2103,'airport codes'!$C$3:$C$2103)","v":"Netherlands"},"2020-12-09","0425","1100","2020-12-31",null,null,null,null,"X",null,null,"PO"]
[950,"EMIRATES","EK9744","AMS",{"$f":"_xlfn.XLOOKUP(' Flight data base'!D951,'airport codes'!$D$3:$D$2103,'airport codes'!$C$3:$C$2103)","v":"Netherlands"},"DXB",{"$f":"_xlfn.XLOOKUP(' Flight data base'!F951,'airport codes'!$D$3:$D$2103,'airport codes'!$C$3:$C$2103)","v":"United Arab Emirates"},"2020-12-09","1500","0045","2020-12-31",null,null,null,null,"X",null,null,"PO"]
[951,"EMIRATES","EK775","DXB",{"$f":"_xlfn.XLOOKUP(' Flight data base'!D952,'airport codes'!$D$3:$D$2103,'airport codes'!$C$3:$C$2103)","v":"United Arab Emirates"},"JNB",{"$f":"_xlfn.XLOOKUP(' Flight data base'!F952,'airport codes'!$D$3:$D$2103,'airport codes'!$C$3:$C$2103)","v":"South Africa"},"2020-12-09","0430","1045","2020-12-31",null,"X",null,"X","X","X","X","PO"]
[952,"EMIRATES","EK775","JNB",{"$f":"_xlfn.XLOOKUP(' Flight data base'!D953,'airport codes'!$D$3:$D$2103,'airport codes'!$C$3:$C$2103)","v":"South Africa"},"DUR",{"$f":"_xlfn.XLOOKUP(' Flight data base'!F953,'airport codes'!$D$3:$D$2103,'airport codes'!$C$3:$C$2103)","v":"South Africa"},"2020-12-09","1225","1335","2020-12-31",null,"X",null,"X","X","X","X","PO"]
[953,"EMIRATES","EK775","DUR",{"$f":"_xlfn.XLOOKUP(' Flight data base'!D954,'airport codes'!$D$3:$D$2103,'airport codes'!$C$3:$C$2103)","v":"South Africa"},"DXB",{"$f":"_xlfn.XLOOKUP(' Flight data base'!F954,'airport codes'!$D$3:$D$2103,'airport codes'!$C$3:$C$2103)","v":"United Arab Emirates"},"2020-12-09","1505","0125","2020-12-31",null,"X",null,"X","X","X","X","PO"]
[954,"EMIRATES","EK729","DXB",{"$f":"_xlfn.XLOOKUP(' Flight data base'!D955,'airport codes'!$D$3:$D$2103,'airport codes'!$C$3:$C$2103)","v":"United Arab Emirates"},"EBB",{"$f":"_xlfn.XLOOKUP(' Flight data base'!F955,'airport codes'!$D$3:$D$2103,'airport codes'!$C$3:$C$2103)","v":"Uganda"},"2020-12-09","1030","1455","2020-12-31",null,null,null,"X","X",null,"X","PO"]
[955,"EMIRATES","EK730","EBB",{"$f":"_xlfn.XLOOKUP(' Flight data base'!D956,'airport codes'!$D$3:$D$2103,'airport codes'!$C$3:$C$2103)","v":"Uganda"},"DXB",{"$f":"_xlfn.XLOOKUP(' Flight data base'!F956,'airport codes'!$D$3:$D$2103,'airport codes'!$C$3:$C$2103)","v":"United Arab Emirates"},"2020-12-09","1655","2310","2020-12-31",null,null,null,"X","X",null,"X","PO"]
[956,"EMIRATES","EK9702","DXB",{"$f":"_xlfn.XLOOKUP(' Flight data base'!D957,'airport codes'!$D$3:$D$2103,'airport codes'!$C$3:$C$2103)","v":"United Arab Emirates"},"EBB",{"$f":"_xlfn.XLOOKUP(' Flight data base'!F957,'airport codes'!$D$3:$D$2103,'airport codes'!$C$3:$C$2103)","v":"Uganda"},"2020-12-09","1235","1705","2020-12-31",null,null,"X",null,null,null,null,"PO"]
[957,"EMIRATES","EK9703","EBB",{"$f":"_xlfn.XLOOKUP(' Flight data base'!D958,'airport codes'!$D$3:$D$2103,'airport codes'!$C$3:$C$2103)","v":"Uganda"},"DXB",{"$f":"_xlfn.XLOOKUP(' Flight data base'!F958,'airport codes'!$D$3:$D$2103,'airport codes'!$C$3:$C$2103)","v":"United Arab Emirates"},"2020-12-09","1835","0100","2020-12-31",null,null,"X",null,null,null,null,"PO"]
[958,"EMIRATES","EK9743","DXB",{"$f":"_xlfn.XLOOKUP(' Flight data base'!D959,'airport codes'!$D$3:$D$2103,'airport codes'!$C$3:$C$2103)","v":"United Arab Emirates"},"EDL",{"$f":"_xlfn.XLOOKUP(' Flight data base'!F959,'airport codes'!$D$3:$D$2103,'airport codes'!$C$3:$C$2103)","v":"Kenya"},"2020-12-09","0955","1400","2020-12-31",null,null,null,"X",null,null,null,"PO"]
[959,"EMIRATES","EK9743","EDL",{"$f":"_xlfn.XLOOKUP(' Flight data base'!D960,'airport codes'!$D$3:$D$2103,'airport codes'!$C$3:$C$2103)","v":"Kenya"},"NBO",{"$f":"_xlfn.XLOOKUP(' Flight data base'!F960,'airport codes'!$D$3:$D$2103,'airport codes'!$C$3:$C$2103)","v":"Kenya"},"2020-12-09","1700","1750","2020-12-31",null,null,null,"X",null,null,null,"PO"]
[960,"EMIRATES","EK9743","NBO",{"$f":"_xlfn.XLOOKUP(' Flight data base'!D961,'airport codes'!$D$3:$D$2103,'airport codes'!$C$3:$C$2103)","v":"Kenya"},"AMS",{"$f":"_xlfn.XLOOKUP(' Flight data base'!F961,'airport codes'!$D$3:$D$2103,'airport codes'!$C$3:$C$2103)","v":"Netherlands"},"2020-12-09","0000","0635","2020-12-31",null,null,null,null,"X",null,null,"PO"]
[961,"EMIRATES","EK9744","AMS",{"$f":"_xlfn.XLOOKUP(' Flight data base'!D962,'airport codes'!$D$3:$D$2103,'airport codes'!$C$3:$C$2103)","v":"Netherlands"},"OSL",{"$f":"_xlfn.XLOOKUP(' Flight data base'!F962,'airport codes'!$D$3:$D$2103,'airport codes'!$C$3:$C$2103)","v":"Norway"},"2020-12-09","1020","1205","2020-12-31",null,null,null,null,"X",null,null,"PO"]
[962,"EMIRATES","EK9744","OSL",{"$f":"_xlfn.XLOOKUP(' Flight data base'!D963,'airport codes'!$D$3:$D$2103,'airport codes'!$C$3:$C$2103)","v":"Norway"},"DXB",{"$f":"_xlfn.XLOOKUP(' Flight data base'!F963,'airport codes'!$D$3:$D$2103,'airport codes'!$C$3:$C$2103)","v":"United Arab Emirates"},"2020-12-09","1400","2345","2020-12-31",null,null,null,null,"X",null,null,"PO"]
[963,"EMIRATES","EK763","DXB",{"$f":"_xlfn.XLOOKUP(' Flight data base'!D964,'airport codes'!$D$3:$D$2103,'airport codes'!$C$3:$C$2103)","v":"United Arab Emirates"},"JNB",{"$f":"_xlfn.XLOOKUP(' Flight data base'!F964,'airport codes'!$D$3:$D$2103,'airport codes'!$C$3:$C$2103)","v":"South Africa"},"2020-12-09","1005","1630","2020-12-31","X","X","X","X","X","X",null,"PO"]
[964,"EMIRATES","EK764","JNB",{"$f":"_xlfn.XLOOKUP(' Flight data base'!D965,'airport codes'!$D$3:$D$2103,'airport codes'!$C$3:$C$2103)","v":"South Africa"},"DXB",{"$f":"_xlfn.XLOOKUP(' Flight data base'!F965,'airport codes'!$D$3:$D$2103,'airport codes'!$C$3:$C$2103)","v":"United Arab Emirates"},"2020-12-09","1850","0505","2020-12-31","X","X","X","X","X","X",null,"PO"]
[965,"EMIRATES","EK767","DXB",{"$f":"_xlfn.XLOOKUP(' Flight data base'!D966,'airport codes'!$D$3:$D$2103,'airport codes'!$C$3:$C$2103)","v":"United Arab Emirates"},"JNB",{"$f":"_xlfn.XLOOKUP(' Flight data base'!F966,'airport codes'!$D$3:$D$2103,'airport codes'!$C$3:$C$2103)","v":"South Africa"},"2020-12-09","0430","1045","2020-12-31","X",null,"X",null,"X",null,null,"PO"]
[966,"EMIRATES","EK768","JNB",{"$f":"_xlfn.XLOOKUP(' Flight data base'!D967,'airport codes'!$D$3:$D$2103,'airport codes'!$C$3:$C$2103)","v":"South Africa"},"DXB",{"$f":"_xlfn.XLOOKUP(' Flight data base'!F967,'airport codes'!$D$3:$D$2103,'airport codes'!$C$3:$C$2103)","v":"United Arab Emirates"},"2020-12-09","1510","0125","2020-12-31","X",null,"X",null,"X",null,null,"PO"]
[967,"EMIRATES","EK761","DXB",{"$f":"_xlfn.XLOOKUP(' Flight data base'!D968,'airport codes'!$D$3:$D$2103,'airport codes'!$C$3:$C$2103)","v":"United Arab Emirates"},"JNB",{"$f":"_xlfn.XLOOKUP(' Flight data base'!F968,'airport codes'!$D$3:$D$2103,'airport codes'!$C$3:$C$2103)","v":"South Africa"},"2020-12-09","0925","1535","2020-12-31","X","X","X","X","X","X","X","PO"]
[968,"EMIRATES","EK762","JNB",{"$f":"_xlfn.XLOOKUP(' Flight data base'!D969,'airport codes'!$D$3:$D$2103,'airport codes'!$C$3:$C$2103)","v":"South Africa"},"DXB",{"$f":"_xlfn.XLOOKUP(' Flight data base'!F969,'airport codes'!$D$3:$D$2103,'airport codes'!$C$3:$C$2103)","v":"United Arab Emirates"},"2020-12-09","1710","0310","2020-12-31","X","X","X","X","X","X","X","PO"]
[969,"EMIRATES","EK765","DXB",{"$f":"_xlfn.XLOOKUP(' Flight data base'!D970,'airport codes'!$D$3:$D$2103,'airport codes'!$C$3:$C$2103)","v":"United Arab Emirates"},"JNB",{"$f":"_xlfn.XLOOKUP(' Flight data base'!F970,'airport codes'!$D$3:$D$2103,'airport codes'!$C$3:$C$2103)","v":"South Africa"},"2020-12-09","1125","1735","2020-12-31",null,null,"X",null,"X",null,null,"PO"]
[970,"EMIRATES","EK766","JNB",{"$f":"_xlfn.XLOOKUP(' Flight data base'!D971,'airport codes'!$D$3:$D$2103,'airport codes'!$C$3:$C$2103)","v":"South Africa"},"DXB",{"$f":"_xlfn.XLOOKUP(' Flight data base'!F971,'airport codes'!$D$3:$D$2103,'airport codes'!$C$3:$C$2103)","v":"United Arab Emirates"},"2020-12-09","1910","0510","2020-12-31",null,null,"X",null,"X",null,null,"PO"]
[971,"EMIRATES","EK733","DXB",{"$f":"_xlfn.XLOOKUP(' Flight data base'!D972,'airport codes'!$D$3:$D$2103,'airport codes'!$C$3:$C$2103)","v":"United Arab Emirates"},"KRT",{"$f":"_xlfn.XLOOKUP(' Flight data base'!F972,'airport codes'!$D$3:$D$2103,'airport codes'!$C$3:$C$2103)","v":"Sudan"},"2020-12-09","1450","1710","2020-12-31","X",null,"X","X","X",null,"X","PO"]
[972,"EMIRATES","EK734","KRT",{"$f":"_xlfn.XLOOKUP(' Flight data base'!D973,'airport codes'!$D$3:$D$2103,'airport codes'!$C$3:$C$2103)","v":"Sudan"},"DXB",{"$f":"_xlfn.XLOOKUP(' Flight data base'!F973,'airport codes'!$D$3:$D$2103,'airport codes'!$C$3:$C$2103)","v":"United Arab Emirates"},"2020-12-09","1845","0040","2020-12-31","X",null,"X","X","X",null,"X","PO"]
[973,"EMIRATES","EK9767","DXB",{"$f":"_xlfn.XLOOKUP(' Flight data base'!D974,'airport codes'!$D$3:$D$2103,'airport codes'!$C$3:$C$2103)","v":"United Arab Emirates"},"KRT",{"$f":"_xlfn.XLOOKUP(' Flight data base'!F974,'airport codes'!$D$3:$D$2103,'airport codes'!$C$3:$C$2103)","v":"Sudan"},"2020-12-09","0755","1000","2020-12-31",null,null,null,null,"X",null,null,"PO"]
[974,"EMIRATES","EK9767","KRT",{"$f":"_xlfn.XLOOKUP(' Flight data base'!D975,'airport codes'!$D$3:$D$2103,'airport codes'!$C$3:$C$2103)","v":"Sudan"},"NBO",{"$f":"_xlfn.XLOOKUP(' Flight data base'!F975,'airport codes'!$D$3:$D$2103,'airport codes'!$C$3:$C$2103)","v":"Kenya"},"2020-12-09","1200","1605","2020-12-31",null,null,null,null,"X",null,null,"PO"]
[975,"EMIRATES","EK9759","NBO",{"$f":"_xlfn.XLOOKUP(' Flight data base'!D976,'airport codes'!$D$3:$D$2103,'airport codes'!$C$3:$C$2103)","v":"Kenya"},"DXB",{"$f":"_xlfn.XLOOKUP(' Flight data base'!F976,'airport codes'!$D$3:$D$2103,'airport codes'!$C$3:$C$2103)","v":"United Arab Emirates"},"2020-12-09","1735","2340","2020-12-31",null,null,null,null,"X",null,null,"PO"]
[976,"EMIRATES","EK9747","DXB",{"$f":"_xlfn.XLOOKUP(' Flight data base'!D977,'airport codes'!$D$3:$D$2103,'airport codes'!$C$3:$C$2103)","v":"United Arab Emirates"},"KRT",{"$f":"_xlfn.XLOOKUP(' Flight data base'!F977,'airport codes'!$D$3:$D$2103,'airport codes'!$C$3:$C$2103)","v":"Sudan"},"2020-12-09","1400","1605","2020-12-31",null,null,"X",null,null,null,null,"PO"]
[977,"EMIRATES","EK9747","KRT",{"$f":"_xlfn.XLOOKUP(' Flight data base'!D978,'airport codes'!$D$3:$D$2103,'airport codes'!$C$3:$C$2103)","v":"Sudan"},"NBO",{"$f":"_xlfn.XLOOKUP(' Flight data base'!F978,'airport codes'!$D$3:$D$2103,'airport codes'!$C$3:$C$2103)","v":"Kenya"},"2020-12-09","1800","2205","2020-12-31",null,null,"X",null,null,null,null,"PO"]
[978,"EMIRATES","EK9747","NBO",{"$f":"_xlfn.XLOOKUP(' Flight data base'!D979,'airport codes'!$D$3:$D$2103,'airport codes'!$C$3:$C$2103)","v":"Kenya"},"AMS",{"$f":"_xlfn.XLOOKUP(' Flight data base'!F979,'airport codes'!$D$3:$D$2103,'airport codes'!$C$3:$C$2103)","v":"Netherlands"},"2020-12-09","0210","0845","2020-12-31",null,null,null,"X",null,null,null,"PO"]
[979,"EMIRATES","EK2564","AMS",{"$f":"_xlfn.XLOOKUP(' Flight data base'!D980,'airport codes'!$D$3:$D$2103,'airport codes'!$C$3:$C$2103)","v":"Netherlands"},"DXB",{"$f":"_xlfn.XLOOKUP(' Flight data base'!F980,'airport codes'!$D$3:$D$2103,'airport codes'!$C$3:$C$2103)","v":"United Arab Emirates"},"2020-12-09","1200","2145","2020-12-31",null,null,null,"X",null,null,null,"PO"]
[980,"EMIRATES","EK793","DXB",{"$f":"_xlfn.XLOOKUP(' Flight data base'!D981,'airport codes'!$D$3:$D$2103,'airport codes'!$C$3:$C$2103)","v":"United Arab Emirates"},"LAD",{"$f":"_xlfn.XLOOKUP(' Flight data base'!F981,'airport codes'!$D$3:$D$2103,'airport codes'!$C$3:$C$2103)","v":"Angola"},"2020-12-09","0755","1250","2020-12-31",null,"X",null,"X",null,null,"X","PO"]
[981,"EMIRATES","EK794","LAD",{"$f":"_xlfn.XLOOKUP(' Flight data base'!D982,'airport codes'!$D$3:$D$2103,'airport codes'!$C$3:$C$2103)","v":"Angola"},"DXB",{"$f":"_xlfn.XLOOKUP(' Flight data base'!F982,'airport codes'!$D$3:$D$2103,'airport codes'!$C$3:$C$2103)","v":"United Arab Emirates"},"2020-12-09","1525","0150","2020-12-31",null,"X",null,"X",null,null,"X","PO"]
[982,"EMIRATES","EK9318","DXB",{"$f":"_xlfn.XLOOKUP(' Flight data base'!D983,'airport codes'!$D$3:$D$2103,'airport codes'!$C$3:$C$2103)","v":"United Arab Emirates"},"LLW",{"$f":"_xlfn.XLOOKUP(' Flight data base'!F983,'airport codes'!$D$3:$D$2103,'airport codes'!$C$3:$C$2103)","v":"Malawi"},"2020-12-09","1025","1435","2020-12-31",null,null,null,null,"X",null,null,"PO"]
[983,"EMIRATES","EK9318","LLW",{"$f":"_xlfn.XLOOKUP(' Flight data base'!D984,'airport codes'!$D$3:$D$2103,'airport codes'!$C$3:$C$2103)","v":"Malawi"},"NBO",{"$f":"_xlfn.XLOOKUP(' Flight data base'!F984,'airport codes'!$D$3:$D$2103,'airport codes'!$C$3:$C$2103)","v":"Kenya"},"2020-12-09","1635","1945","2020-12-31",null,null,null,null,"X",null,null,"PO"]
[984,"EMIRATES","EK9749","NBO",{"$f":"_xlfn.XLOOKUP(' Flight data base'!D985,'airport codes'!$D$3:$D$2103,'airport codes'!$C$3:$C$2103)","v":"Kenya"},"AMS",{"$f":"_xlfn.XLOOKUP(' Flight data base'!F985,'airport codes'!$D$3:$D$2103,'airport codes'!$C$3:$C$2103)","v":"Netherlands"},"2020-12-09","0325","1000","2020-12-31",null,null,null,null,null,"X",null,"PO"]
[985,"EMIRATES","EK9746","AMS",{"$f":"_xlfn.XLOOKUP(' Flight data base'!D986,'airport codes'!$D$3:$D$2103,'airport codes'!$C$3:$C$2103)","v":"Netherlands"},"DXB",{"$f":"_xlfn.XLOOKUP(' Flight data base'!F986,'airport codes'!$D$3:$D$2103,'airport codes'!$C$3:$C$2103)","v":"United Arab Emirates"},"2020-12-09","1700","0245","2020-12-31",null,null,null,null,null,"X",null,"SF"]
[986,"EMIRATES","EK9318","DXB",{"$f":"_xlfn.XLOOKUP(' Flight data base'!D987,'airport codes'!$D$3:$D$2103,'airport codes'!$C$3:$C$2103)","v":"United Arab Emirates"},"LLW",{"$f":"_xlfn.XLOOKUP(' Flight data base'!F987,'airport codes'!$D$3:$D$2103,'airport codes'!$C$3:$C$2103)","v":"Malawi"},"2020-12-09","0955","1405","2020-12-31",null,null,null,null,null,"X",null,"PO"]
[987,"EMIRATES","EK9318","LLW",{"$f":"_xlfn.XLOOKUP(' Flight data base'!D988,'airport codes'!$D$3:$D$2103,'airport codes'!$C$3:$C$2103)","v":"Malawi"},"NBO",{"$f":"_xlfn.XLOOKUP(' Flight data base'!F988,'airport codes'!$D$3:$D$2103,'airport codes'!$C$3:$C$2103)","v":"Kenya"},"2020-12-09","1605","1915","2020-12-31",null,null,null,null,null,"X",null,"PO"]
[988,"EMIRATES","EK9743","NBO",{"$f":"_xlfn.XLOOKUP(' Flight data base'!D989,'airport codes'!$D$3:$D$2103,'airport codes'!$C$3:$C$2103)","v":"Kenya"},"AMS",{"$f":"_xlfn.XLOOKUP(' Flight data base'!F989,'airport codes'!$D$3:$D$2103,'airport codes'!$C$3:$C$2103)","v":"Netherlands"},"2020-12-09","0000","0635","2020-12-31",null,null,null,null,null,null,"X","PO"]
[989,"EMIRATES","EK9756","AMS",{"$f":"_xlfn.XLOOKUP(' Flight data base'!D990,'airport codes'!$D$3:$D$2103,'airport codes'!$C$3:$C$2103)","v":"Netherlands"},"DXB",{"$f":"_xlfn.XLOOKUP(' Flight data base'!F990,'airport codes'!$D$3:$D$2103,'airport codes'!$C$3:$C$2103)","v":"United Arab Emirates"},"2020-12-09","1200","2145","2020-12-31",null,null,null,null,null,null,"X","PO"]
[990,"EMIRATES","EK783","DXB",{"$f":"_xlfn.XLOOKUP(' Flight data base'!D991,'airport codes'!$D$3:$D$2103,'airport codes'!$C$3:$C$2103)","v":"United Arab Emirates"},"LOS",{"$f":"_xlfn.XLOOKUP(' Flight data base'!F991,'airport codes'!$D$3:$D$2103,'airport codes'!$C$3:$C$2103)","v":"Nigeria"},"2020-12-09","1030","1540","2020-12-31","X","X","X","X","X","X","X","PO"]
[991,"EMIRATES","EK784","LOS",{"$f":"_xlfn.XLOOKUP(' Flight data base'!D992,'airport codes'!$D$3:$D$2103,'airport codes'!$C$3:$C$2103)","v":"Nigeria"},"DXB",{"$f":"_xlfn.XLOOKUP(' Flight data base'!F992,'airport codes'!$D$3:$D$2103,'airport codes'!$C$3:$C$2103)","v":"United Arab Emirates"},"2020-12-09","1810","0415","2020-12-31","X","X","X","X","X","X","X","PO"]
[992,"EMIRATES","EK713","DXB",{"$f":"_xlfn.XLOOKUP(' Flight data base'!D993,'airport codes'!$D$3:$D$2103,'airport codes'!$C$3:$C$2103)","v":"United Arab Emirates"},"LUN",{"$f":"_xlfn.XLOOKUP(' Flight data base'!F993,'airport codes'!$D$3:$D$2103,'airport codes'!$C$3:$C$2103)","v":"Zambia"},"2020-12-09","0330","0840","2020-12-31",null,null,null,"X","X",null,"X","PO"]
[993,"EMIRATES","EK713","LUN",{"$f":"_xlfn.XLOOKUP(' Flight data base'!D994,'airport codes'!$D$3:$D$2103,'airport codes'!$C$3:$C$2103)","v":"Zambia"},"HRE",{"$f":"_xlfn.XLOOKUP(' Flight data base'!F994,'airport codes'!$D$3:$D$2103,'airport codes'!$C$3:$C$2103)","v":"Zimbabwe"},"2020-12-09","1010","1115","2020-12-31",null,null,null,"X","X",null,"X","PO"]
[994,"EMIRATES","EK714","HRE",{"$f":"_xlfn.XLOOKUP(' Flight data base'!D995,'airport codes'!$D$3:$D$2103,'airport codes'!$C$3:$C$2103)","v":"Zimbabwe"},"LUN",{"$f":"_xlfn.XLOOKUP(' Flight data base'!F995,'airport codes'!$D$3:$D$2103,'airport codes'!$C$3:$C$2103)","v":"Zambia"},"2020-12-09","1255","1400","2020-12-31",null,null,null,"X","X",null,"X","PO"]
[995,"EMIRATES","EK714","LUN",{"$f":"_xlfn.XLOOKUP(' Flight data base'!D996,'airport codes'!$D$3:$D$2103,'airport codes'!$C$3:$C$2103)","v":"Zambia"},"DXB",{"$f":"_xlfn.XLOOKUP(' Flight data base'!F996,'airport codes'!$D$3:$D$2103,'airport codes'!$C$3:$C$2103)","v":"United Arab Emirates"},"2020-12-09","1530","0035","2020-12-31",null,null,null,"X","X",null,"X","PO"]
[996,"EMIRATES","EK9747","DXB",{"$f":"_xlfn.XLOOKUP(' Flight data base'!D997,'airport codes'!$D$3:$D$2103,'airport codes'!$C$3:$C$2103)","v":"United Arab Emirates"},"ADD",{"$f":"_xlfn.XLOOKUP(' Flight data base'!F997,'airport codes'!$D$3:$D$2103,'airport codes'!$C$3:$C$2103)","v":"Ethiopia"},"2020-12-09","0850","1400","2020-12-31",null,null,null,"X",null,null,null,"PO"]
[997,"EMIRATES","EK9747","ADD",{"$f":"_xlfn.XLOOKUP(' Flight data base'!D998,'airport codes'!$D$3:$D$2103,'airport codes'!$C$3:$C$2103)","v":"Ethiopia"},"NBO",{"$f":"_xlfn.XLOOKUP(' Flight data base'!F998,'airport codes'!$D$3:$D$2103,'airport codes'!$C$3:$C$2103)","v":"Kenya"},"2020-12-09","1605","1950","2020-12-31",null,null,null,"X",null,null,null,"PO"]
[998,"EMIRATES","EK9747","NBO",{"$f":"_xlfn.XLOOKUP(' Flight data base'!D999,'airport codes'!$D$3:$D$2103,'airport codes'!$C$3:$C$2103)","v":"Kenya"},"AMS",{"$f":"_xlfn.XLOOKUP(' Flight data base'!F999,'airport codes'!$D$3:$D$2103,'airport codes'!$C$3:$C$2103)","v":"Netherlands"},"2020-12-09","0210","0845","2020-12-31",null,null,null,null,"X",null,null,"PO"]
[999,"EMIRATES","EK9758","AMS",{"$f":"_xlfn.XLOOKUP(' Flight data base'!D1000,'airport codes'!$D$3:$D$2103,'airport codes'!$C$3:$C$2103)","v":"Netherlands"},"OSL",{"$f":"_xlfn.XLOOKUP(' Flight data base'!F1000,'airport codes'!$D$3:$D$2103,'airport codes'!$C$3:$C$2103)","v":"Norway"},"2020-12-09","1330","1515","2020-12-31",null,null,null,null,"X",null,null,"PO"]
[1000,"EMIRATES","EK9758","OSL",{"$f":"_xlfn.XLOOKUP(' Flight data base'!D1001,'airport codes'!$D$3:$D$2103,'airport codes'!$C$3:$C$2103)","v":"Norway"},"DXB",{"$f":"_xlfn.XLOOKUP(' Flight data base'!F1001,'airport codes'!$D$3:$D$2103,'airport codes'!$C$3:$C$2103)","v":"United Arab Emirates"},"2020-12-09","1700","0240","2020-12-31",null,null,null,null,"X",null,null,"PO"]
[1001,"EMIRATES","EK703","DXB",{"$f":"_xlfn.XLOOKUP(' Flight data base'!D1002,'airport codes'!$D$3:$D$2103,'airport codes'!$C$3:$C$2103)","v":"United Arab Emirates"},"MRU",{"$f":"_xlfn.XLOOKUP(' Flight data base'!F1002,'airport codes'!$D$3:$D$2103,'airport codes'!$C$3:$C$2103)","v":"Mauritius"},"2020-12-09","0825","1505","2020-12-31",null,"X",null,null,null,null,null,"PO"]
[1002,"EMIRATES","EK702","MRU",{"$f":"_xlfn.XLOOKUP(' Flight data base'!D1003,'airport codes'!$D$3:$D$2103,'airport codes'!$C$3:$C$2103)","v":"Mauritius"},"DXB",{"$f":"_xlfn.XLOOKUP(' Flight data base'!F1003,'airport codes'!$D$3:$D$2103,'airport codes'!$C$3:$C$2103)","v":"United Arab Emirates"},"2020-12-09","1645","2325","2020-12-31",null,"X",null,null,null,null,null,"PO"]
[1003,"EMIRATES","EK703","DXB",{"$f":"_xlfn.XLOOKUP(' Flight data base'!D1004,'airport codes'!$D$3:$D$2103,'airport codes'!$C$3:$C$2103)","v":"United Arab Emirates"},"MRU",{"$f":"_xlfn.XLOOKUP(' Flight data base'!F1004,'airport codes'!$D$3:$D$2103,'airport codes'!$C$3:$C$2103)","v":"Mauritius"},"2020-12-09","0920","1600","2020-12-31",null,null,null,null,null,"X",null,"PO"]
[1004,"EMIRATES","EK702","MRU",{"$f":"_xlfn.XLOOKUP(' Flight data base'!D1005,'airport codes'!$D$3:$D$2103,'airport codes'!$C$3:$C$2103)","v":"Mauritius"},"DXB",{"$f":"_xlfn.XLOOKUP(' Flight data base'!F1005,'airport codes'!$D$3:$D$2103,'airport codes'!$C$3:$C$2103)","v":"United Arab Emirates"},"2020-12-09","1645","2325","2020-12-31",null,null,null,null,null,null,"X","PO"]
[1005,"EMIRATES","EK719","DXB",{"$f":"_xlfn.XLOOKUP(' Flight data base'!D1006,'airport codes'!$D$3:$D$2103,'airport codes'!$C$3:$C$2103)","v":"United Arab Emirates"},"NBO",{"$f":"_xlfn.XLOOKUP(' Flight data base'!F1006,'airport codes'!$D$3:$D$2103,'airport codes'!$C$3:$C$2103)","v":"Kenya"},"2020-12-09","0205","0615","2020-12-31","X","X","X","X","X","X","X","PO"]
[1006,"EMIRATES","EK722","NBO",{"$f":"_xlfn.XLOOKUP(' Flight data base'!D1007,'airport codes'!$D$3:$D$2103,'airport codes'!$C$3:$C$2103)","v":"Kenya"},"DXB",{"$f":"_xlfn.XLOOKUP(' Flight data base'!F1007,'airport codes'!$D$3:$D$2103,'airport codes'!$C$3:$C$2103)","v":"United Arab Emirates"},"2020-12-09","2355","0555","2020-12-31","X","X","X","X","X","X","X","PO"]
[1007,"EMIRATES","EK9757","DXB",{"$f":"_xlfn.XLOOKUP(' Flight data base'!D1008,'airport codes'!$D$3:$D$2103,'airport codes'!$C$3:$C$2103)","v":"United Arab Emirates"},"NBO",{"$f":"_xlfn.XLOOKUP(' Flight data base'!F1008,'airport codes'!$D$3:$D$2103,'airport codes'!$C$3:$C$2103)","v":"Kenya"},"2020-12-09","1015","1415","2020-12-31",null,"X",null,null,null,null,"X","PO"]
[1008,"EMIRATES","EK9759","NBO",{"$f":"_xlfn.XLOOKUP(' Flight data base'!D1009,'airport codes'!$D$3:$D$2103,'airport codes'!$C$3:$C$2103)","v":"Kenya"},"DXB",{"$f":"_xlfn.XLOOKUP(' Flight data base'!F1009,'airport codes'!$D$3:$D$2103,'airport codes'!$C$3:$C$2103)","v":"United Arab Emirates"},"2020-12-09","1615","2220","2020-12-31",null,"X",null,null,null,null,"X","PO"]
[1009,"EMIRATES","EK705","DXB",{"$f":"_xlfn.XLOOKUP(' Flight data base'!D1010,'airport codes'!$D$3:$D$2103,'airport codes'!$C$3:$C$2103)","v":"United Arab Emirates"},"SEZ",{"$f":"_xlfn.XLOOKUP(' Flight data base'!F1010,'airport codes'!$D$3:$D$2103,'airport codes'!$C$3:$C$2103)","v":"Seychelles"},"2020-12-09","0235","0705","2020-12-31",null,null,null,null,"X","X","X","PO"]
[1010,"EMIRATES","EK708","SEZ",{"$f":"_xlfn.XLOOKUP(' Flight data base'!D1011,'airport codes'!$D$3:$D$2103,'airport codes'!$C$3:$C$2103)","v":"Seychelles"},"DXB",{"$f":"_xlfn.XLOOKUP(' Flight data base'!F1011,'airport codes'!$D$3:$D$2103,'airport codes'!$C$3:$C$2103)","v":"United Arab Emirates"},"2020-12-09","2350","0420","2020-12-31",null,null,null,null,"X","X","X","PO"]
[1011,"EMIRATES","EK705","DXB",{"$f":"_xlfn.XLOOKUP(' Flight data base'!D1012,'airport codes'!$D$3:$D$2103,'airport codes'!$C$3:$C$2103)","v":"United Arab Emirates"},"SEZ",{"$f":"_xlfn.XLOOKUP(' Flight data base'!F1012,'airport codes'!$D$3:$D$2103,'airport codes'!$C$3:$C$2103)","v":"Seychelles"},"2020-12-09","0235","0705","2020-12-31","X",null,null,null,null,null,null,"PO"]
[1012,"EMIRATES","EK708","SEZ",{"$f":"_xlfn.XLOOKUP(' Flight data base'!D1013,'airport codes'!$D$3:$D$2103,'airport codes'!$C$3:$C$2103)","v":"Seychelles"},"DXB",{"$f":"_xlfn.XLOOKUP(' Flight data base'!F1013,'airport codes'!$D$3:$D$2103,'airport codes'!$C$3:$C$2103)","v":"United Arab Emirates"},"2020-12-09","2145","0215","2020-12-31","X",null,null,null,null,null,null,"PO"]
[1013,"EMIRATES","EK747","DXB",{"$f":"_xlfn.XLOOKUP(' Flight data base'!D1014,'airport codes'!$D$3:$D$2103,'airport codes'!$C$3:$C$2103)","v":"United Arab Emirates"},"TUN",{"$f":"_xlfn.XLOOKUP(' Flight data base'!F1014,'airport codes'!$D$3:$D$2103,'airport codes'!$C$3:$C$2103)","v":"Tunisia"},"2020-12-09","0840","1235","2020-12-31","X",null,"X",null,"X",null,"X","PO"]
[1014,"EMIRATES","EK748","TUN",{"$f":"_xlfn.XLOOKUP(' Flight data base'!D1015,'airport codes'!$D$3:$D$2103,'airport codes'!$C$3:$C$2103)","v":"Tunisia"},"DXB",{"$f":"_xlfn.XLOOKUP(' Flight data base'!F1015,'airport codes'!$D$3:$D$2103,'airport codes'!$C$3:$C$2103)","v":"United Arab Emirates"},"2020-12-09","1455","2330","2020-12-31","X",null,"X",null,"X",null,"X","PO"]
[1015,"ETHIAD","EY0956","JNB",{"$f":"_xlfn.XLOOKUP(' Flight data base'!D1016,'airport codes'!$D$3:$D$2103,'airport codes'!$C$3:$C$2103)","v":"South Africa"},"NBO",{"$f":"_xlfn.XLOOKUP(' Flight data base'!F1016,'airport codes'!$D$3:$D$2103,'airport codes'!$C$3:$C$2103)","v":"Kenya"},"2020-12-01",null,null,null,"X",null,"X",null,null,"X",null,"FF"]
[1016,"ETHIAD","EY0957","NBO",{"$f":"_xlfn.XLOOKUP(' Flight data base'!D1017,'airport codes'!$D$3:$D$2103,'airport codes'!$C$3:$C$2103)","v":"Kenya"},"AMS",{"$f":"_xlfn.XLOOKUP(' Flight data base'!F1017,'airport codes'!$D$3:$D$2103,'airport codes'!$C$3:$C$2103)","v":"Netherlands"},"2020-12-01",null,null,null,null,"X",null,null,null,null,null,"FF"]
[1017,"ETHIAD","EY0950","NBO",{"$f":"_xlfn.XLOOKUP(' Flight data base'!D1018,'airport codes'!$D$3:$D$2103,'airport codes'!$C$3:$C$2103)","v":"Kenya"},"AUH",{"$f":"_xlfn.XLOOKUP(' Flight data base'!F1018,'airport codes'!$D$3:$D$2103,'airport codes'!$C$3:$C$2103)","v":"United Arab Emirates"},"2020-12-01",null,null,null,null,null,null,"X",null,"X",null,"FF"]
[1018,"KENYA AIRWAYS","KQ2100","NBO",{"$f":"_xlfn.XLOOKUP(' Flight data base'!D1019,'airport codes'!$D$3:$D$2103,'airport codes'!$C$3:$C$2103)","v":"Kenya"},"LHR",{"$f":"_xlfn.XLOOKUP(' Flight data base'!F1019,'airport codes'!$D$3:$D$2103,'airport codes'!$C$3:$C$2103)","v":"United Kingdom"},"2020-12-01",null,null,null,"X",null,null,"X",null,null,null,"PF"]
[1019,"KENYA AIRWAYS","KQ2116","NBO",{"$f":"_xlfn.XLOOKUP(' Flight data base'!D1020,'airport codes'!$D$3:$D$2103,'airport codes'!$C$3:$C$2103)","v":"Kenya"},"AMS",{"$f":"_xlfn.XLOOKUP(' Flight data base'!F1020,'airport codes'!$D$3:$D$2103,'airport codes'!$C$3:$C$2103)","v":"Netherlands"},"2020-12-01",null,null,null,null,null,"X",null,null,null,null,"PF"]
[1020,"AIR FRANCE","AF 0878","NDJ",{"$f":"_xlfn.XLOOKUP(' Flight data base'!D1021,'airport codes'!$D$3:$D$2103,'airport codes'!$C$3:$C$2103)","v":"Chad"},"CDG",{"$f":"_xlfn.XLOOKUP(' Flight data base'!F1021,'airport codes'!$D$3:$D$2103,'airport codes'!$C$3:$C$2103)","v":"France"},"2020-12-14",null,null,"2021-01-03",null,null,"X",null,null,"X",null,"PF"]
[1021,"AIR FRANCE","AF6746","NDJ",{"$f":"_xlfn.XLOOKUP(' Flight data base'!D1022,'airport codes'!$D$3:$D$2103,'airport codes'!$C$3:$C$2103)","v":"Chad"},"CDG",{"$f":"_xlfn.XLOOKUP(' Flight data base'!F1022,'airport codes'!$D$3:$D$2103,'airport codes'!$C$3:$C$2103)","v":"France"},"2020-12-14",null,null,"2021-01-03","X",null,null,null,null,null,null,"PF"]
[1022,"AIR FRANCE","AF 6906","NIM",{"$f":"_xlfn.XLOOKUP(' Flight data base'!D1023,'airport codes'!$D$3:$D$2103,'airport codes'!$C$3:$C$2103)","v":"Niger"},"CDG",{"$f":"_xlfn.XLOOKUP(' Flight data base'!F1023,'airport codes'!$D$3:$D$2103,'airport codes'!$C$3:$C$2103)","v":"France"},"2020-12-14",null,null,"2021-01-03",null,null,null,null,null,null,"X","PF"]
[1023,"AIR FRANCE","AF 0306","NIM",{"$f":"_xlfn.XLOOKUP(' Flight data base'!D1024,'airport codes'!$D$3:$D$2103,'airport codes'!$C$3:$C$2103)","v":"Niger"},"CDG",{"$f":"_xlfn.XLOOKUP(' Flight data base'!F1024,'airport codes'!$D$3:$D$2103,'airport codes'!$C$3:$C$2103)","v":"France"},"2020-12-14",null,null,"2021-01-03","X",null,"X","X",null,"X",null,"PF"]
[1024,"AIR FRANCE","AF0724","NKC",{"$f":"_xlfn.XLOOKUP(' Flight data base'!D1025,'airport codes'!$D$3:$D$2103,'airport codes'!$C$3:$C$2103)","v":"Mauritania"},"CDG",{"$f":"_xlfn.XLOOKUP(' Flight data base'!F1025,'airport codes'!$D$3:$D$2103,'airport codes'!$C$3:$C$2103)","v":"France"},"2020-12-14",null,null,"2021-01-03",null,null,"X",null,"X",null,null,"PF"]
[1025,"AIR FRANCE","AF0727","NKC",{"$f":"_xlfn.XLOOKUP(' Flight data base'!D1026,'airport codes'!$D$3:$D$2103,'airport codes'!$C$3:$C$2103)","v":"Mauritania"},"CDG",{"$f":"_xlfn.XLOOKUP(' Flight data base'!F1026,'airport codes'!$D$3:$D$2103,'airport codes'!$C$3:$C$2103)","v":"France"},"2020-12-14",null,null,"2021-01-03","X",null,null,null,null,null,null,"PF"]
[1026,"AIR FRANCE","AF0751","NKC",{"$f":"_xlfn.XLOOKUP(' Flight data base'!D1027,'airport codes'!$D$3:$D$2103,'airport codes'!$C$3:$C$2103)","v":"Mauritania"},"CDG",{"$f":"_xlfn.XLOOKUP(' Flight data base'!F1027,'airport codes'!$D$3:$D$2103,'airport codes'!$C$3:$C$2103)","v":"France"},"2020-12-14",null,null,"2021-01-03",null,null,null,null,null,null,"X","PF"]
[1027,"AIR FRANCE","AF 0982","NSI",{"$f":"_xlfn.XLOOKUP(' Flight data base'!D1028,'airport codes'!$D$3:$D$2103,'airport codes'!$C$3:$C$2103)","v":"Cameroon"},"CDG",{"$f":"_xlfn.XLOOKUP(' Flight data base'!F1028,'airport codes'!$D$3:$D$2103,'airport codes'!$C$3:$C$2103)","v":"France"},"2020-12-14",null,null,"2021-01-03",null,null,null,"X",null,null,"X","PF"]
[1028,"AIR FRANCE","AF0775","NSI",{"$f":"_xlfn.XLOOKUP(' Flight data base'!D1029,'airport codes'!$D$3:$D$2103,'airport codes'!$C$3:$C$2103)","v":"Cameroon"},"CDG",{"$f":"_xlfn.XLOOKUP(' Flight data base'!F1029,'airport codes'!$D$3:$D$2103,'airport codes'!$C$3:$C$2103)","v":"France"},"2020-12-14",null,null,"2021-01-03",null,"X",null,null,null,null,null,"PF"]
[1029,"AIR FRANCE","AF0900","NSI",{"$f":"_xlfn.XLOOKUP(' Flight data base'!D1030,'airport codes'!$D$3:$D$2103,'airport codes'!$C$3:$C$2103)","v":"Cameroon"},"CDG",{"$f":"_xlfn.XLOOKUP(' Flight data base'!F1030,'airport codes'!$D$3:$D$2103,'airport codes'!$C$3:$C$2103)","v":"France"},"2020-12-14",null,null,"2021-01-03","X",null,null,null,"X",null,null,"PF"]
[1030,"AIR FRANCE","AF 0584","OUA",{"$f":"_xlfn.XLOOKUP(' Flight data base'!D1031,'airport codes'!$D$3:$D$2103,'airport codes'!$C$3:$C$2103)","v":"Burkina Faso"},"CDG",{"$f":"_xlfn.XLOOKUP(' Flight data base'!F1031,'airport codes'!$D$3:$D$2103,'airport codes'!$C$3:$C$2103)","v":"France"},"2020-12-07",null,null,"2021-01-03",null,"X",null,"X",null,null,"X","PF"]
[1031,"AIR FRANCE","AF0914","OUA",{"$f":"_xlfn.XLOOKUP(' Flight data base'!D1032,'airport codes'!$D$3:$D$2103,'airport codes'!$C$3:$C$2103)","v":"Burkina Faso"},"CDG",{"$f":"_xlfn.XLOOKUP(' Flight data base'!F1032,'airport codes'!$D$3:$D$2103,'airport codes'!$C$3:$C$2103)","v":"France"},"2020-12-14",null,null,"2021-01-03","X",null,null,null,null,"X",null,"PF"]
[1032,"AIR FRANCE","AF6728","OUA",{"$f":"_xlfn.XLOOKUP(' Flight data base'!D1033,'airport codes'!$D$3:$D$2103,'airport codes'!$C$3:$C$2103)","v":"Burkina Faso"},"CDG",{"$f":"_xlfn.XLOOKUP(' Flight data base'!F1033,'airport codes'!$D$3:$D$2103,'airport codes'!$C$3:$C$2103)","v":"France"},"2020-12-14",null,null,"2021-01-03",null,null,"X",null,"X",null,null,"PF"]
[1033,"KLM","KL0713","PBM",{"$f":"_xlfn.XLOOKUP(' Flight data base'!D1034,'airport codes'!$D$3:$D$2103,'airport codes'!$C$3:$C$2103)","v":"Suriname"},"AMS",{"$f":"_xlfn.XLOOKUP(' Flight data base'!F1034,'airport codes'!$D$3:$D$2103,'airport codes'!$C$3:$C$2103)","v":"Netherlands"},"2020-12-14",null,null,"2021-01-03",null,null,null,null,"X",null,"X"]
[1034,"AIR FRANCE","AF0830","PNR",{"$f":"_xlfn.XLOOKUP(' Flight data base'!D1035,'airport codes'!$D$3:$D$2103,'airport codes'!$C$3:$C$2103)","v":"Congo (ROC)"},"CDG",{"$f":"_xlfn.XLOOKUP(' Flight data base'!F1035,'airport codes'!$D$3:$D$2103,'airport codes'!$C$3:$C$2103)","v":"France"},"2020-12-14",null,null,"2021-01-03",null,"X",null,"X",null,null,null,"PF"]
[1035,"AIR FRANCE","AF 0792","PTP",{"$f":"_xlfn.XLOOKUP(' Flight data base'!D1036,'airport codes'!$D$3:$D$2103,'airport codes'!$C$3:$C$2103)","v":"Guadeloupe"},"CDG",{"$f":"_xlfn.XLOOKUP(' Flight data base'!F1036,'airport codes'!$D$3:$D$2103,'airport codes'!$C$3:$C$2103)","v":"France"},"2020-12-14",null,null,"2021-01-03","X","X","X","X","X","X","X","PF"]
[1036,"AIR FRANCE","AF0766","PTP",{"$f":"_xlfn.XLOOKUP(' Flight data base'!D1037,'airport codes'!$D$3:$D$2103,'airport codes'!$C$3:$C$2103)","v":"Guadeloupe"},"CDG",{"$f":"_xlfn.XLOOKUP(' Flight data base'!F1037,'airport codes'!$D$3:$D$2103,'airport codes'!$C$3:$C$2103)","v":"France"},"2020-12-13",null,null,"2021-01-03","X","X","X","X","X","X","X","PF"]
[1037,"AIR FRANCE","AF0740","PTP",{"$f":"_xlfn.XLOOKUP(' Flight data base'!D1038,'airport codes'!$D$3:$D$2103,'airport codes'!$C$3:$C$2103)","v":"Guadeloupe"},"CDG",{"$f":"_xlfn.XLOOKUP(' Flight data base'!F1038,'airport codes'!$D$3:$D$2103,'airport codes'!$C$3:$C$2103)","v":"France"},"2020-12-28",null,null,"2021-01-03",null,"X","X","X",null,"X",null,"PF"]
[1038,"AIR FRANCE","AF0762","PTP",{"$f":"_xlfn.XLOOKUP(' Flight data base'!D1039,'airport codes'!$D$3:$D$2103,'airport codes'!$C$3:$C$2103)","v":"Guadeloupe"},"CDG",{"$f":"_xlfn.XLOOKUP(' Flight data base'!F1039,'airport codes'!$D$3:$D$2103,'airport codes'!$C$3:$C$2103)","v":"France"},"2020-12-21",null,null,"2021-01-03","X",null,null,null,"X",null,"X"]
[1039,"AIR FRANCE","AF0760","PUJ",{"$f":"_xlfn.XLOOKUP(' Flight data base'!D1040,'airport codes'!$D$3:$D$2103,'airport codes'!$C$3:$C$2103)","v":"Dominican Republic"},"CDG",{"$f":"_xlfn.XLOOKUP(' Flight data base'!F1040,'airport codes'!$D$3:$D$2103,'airport codes'!$C$3:$C$2103)","v":"France"},"2020-12-14",null,null,"2021-01-03",null,"X",null,"X",null,null,"X","PF"]
[1040,"AIR FRANCE","AF0968","PUJ",{"$f":"_xlfn.XLOOKUP(' Flight data base'!D1041,'airport codes'!$D$3:$D$2103,'airport codes'!$C$3:$C$2103)","v":"Dominican Republic"},"CDG",{"$f":"_xlfn.XLOOKUP(' Flight data base'!F1041,'airport codes'!$D$3:$D$2103,'airport codes'!$C$3:$C$2103)","v":"France"},"2020-12-28",null,null,"2021-01-03",null,null,"X",null,"X","X",null,"PF"]
[1041,"AIR FRANCE","AF0530","ROB",{"$f":"_xlfn.XLOOKUP(' Flight data base'!D1042,'airport codes'!$D$3:$D$2103,'airport codes'!$C$3:$C$2103)","v":"Liberia"},"CDG",{"$f":"_xlfn.XLOOKUP(' Flight data base'!F1042,'airport codes'!$D$3:$D$2103,'airport codes'!$C$3:$C$2103)","v":"France"},"2020-12-14",null,null,"2021-01-03","X","X","X","X","X","X","X","PF"]
[1042,"AIR FRANCE","AF 0470","RUN",{"$f":"_xlfn.XLOOKUP(' Flight data base'!D1043,'airport codes'!$D$3:$D$2103,'airport codes'!$C$3:$C$2103)","v":"Reunion"},"CDG",{"$f":"_xlfn.XLOOKUP(' Flight data base'!F1043,'airport codes'!$D$3:$D$2103,'airport codes'!$C$3:$C$2103)","v":"France"},"2020-12-14",null,null,"2021-01-03",null,null,"X",null,"X",null,"X","PF"]
[1043,"AIR FRANCE","AF6902","RUN",{"$f":"_xlfn.XLOOKUP(' Flight data base'!D1044,'airport codes'!$D$3:$D$2103,'airport codes'!$C$3:$C$2103)","v":"Reunion"},"CDG",{"$f":"_xlfn.XLOOKUP(' Flight data base'!F1044,'airport codes'!$D$3:$D$2103,'airport codes'!$C$3:$C$2103)","v":"France"},"2020-12-14",null,null,"2021-01-03",null,null,"X","X",null,"X",null,"PF"]
[1044,"AIR FRANCE","AF6906","RUN",{"$f":"_xlfn.XLOOKUP(' Flight data base'!D1045,'airport codes'!$D$3:$D$2103,'airport codes'!$C$3:$C$2103)","v":"Reunion"},"CDG",{"$f":"_xlfn.XLOOKUP(' Flight data base'!F1045,'airport codes'!$D$3:$D$2103,'airport codes'!$C$3:$C$2103)","v":"France"},"2020-12-14",null,null,"2021-01-03",null,"X","X",null,null,null,null,"PF"]
[1045,"AIR FRANCE","AF0642","RUN",{"$f":"_xlfn.XLOOKUP(' Flight data base'!D1046,'airport codes'!$D$3:$D$2103,'airport codes'!$C$3:$C$2103)","v":"Reunion"},"CDG",{"$f":"_xlfn.XLOOKUP(' Flight data base'!F1046,'airport codes'!$D$3:$D$2103,'airport codes'!$C$3:$C$2103)","v":"France"},"2020-12-14",null,null,"2021-01-03","X","X","X","X","X","X","X","PF"]
[1046,"AIR FRANCE","AF0644","RUN",{"$f":"_xlfn.XLOOKUP(' Flight data base'!D1047,'airport codes'!$D$3:$D$2103,'airport codes'!$C$3:$C$2103)","v":"Reunion"},"CDG",{"$f":"_xlfn.XLOOKUP(' Flight data base'!F1047,'airport codes'!$D$3:$D$2103,'airport codes'!$C$3:$C$2103)","v":"France"},"2020-12-07",null,null,"2021-01-03","X","X","X","X","X","X","X","PF"]
[1047,"AIR FRANCE","AF6908","RUN",{"$f":"_xlfn.XLOOKUP(' Flight data base'!D1048,'airport codes'!$D$3:$D$2103,'airport codes'!$C$3:$C$2103)","v":"Reunion"},"CDG",{"$f":"_xlfn.XLOOKUP(' Flight data base'!F1048,'airport codes'!$D$3:$D$2103,'airport codes'!$C$3:$C$2103)","v":"France"},"2020-12-07",null,null,"2021-01-03","X",null,null,null,null,null,null,"FF"]
[1048,"AIR FRANCE","AF0760","SDQ",{"$f":"_xlfn.XLOOKUP(' Flight data base'!D1049,'airport codes'!$D$3:$D$2103,'airport codes'!$C$3:$C$2103)","v":"Dominican Republic"},"CDG",{"$f":"_xlfn.XLOOKUP(' Flight data base'!F1049,'airport codes'!$D$3:$D$2103,'airport codes'!$C$3:$C$2103)","v":"France"},"2020-12-13",null,null,"2021-01-03",null,"X",null,"X",null,null,"X","PF"]
[1049,"AIR FRANCE","AF0958","SSG",{"$f":"_xlfn.XLOOKUP(' Flight data base'!D1050,'airport codes'!$D$3:$D$2103,'airport codes'!$C$3:$C$2103)","v":"Equatorial Guinea"},"CDG",{"$f":"_xlfn.XLOOKUP(' Flight data base'!F1050,'airport codes'!$D$3:$D$2103,'airport codes'!$C$3:$C$2103)","v":"France"},"2020-12-14",null,null,"2021-01-03",null,null,null,"X"]
[1050,"AIR FRANCE","AF0498","SXM",{"$f":"_xlfn.XLOOKUP(' Flight data base'!D1051,'airport codes'!$D$3:$D$2103,'airport codes'!$C$3:$C$2103)","v":"Netherlands Antilles"},"CDG",{"$f":"_xlfn.XLOOKUP(' Flight data base'!F1051,'airport codes'!$D$3:$D$2103,'airport codes'!$C$3:$C$2103)","v":"France"},"2020-12-13",null,null,"2021-01-03","X","X","X","X","X","X","X","PF"]
[1051,"KLM","KL0729","SXM",{"$f":"_xlfn.XLOOKUP(' Flight data base'!D1052,'airport codes'!$D$3:$D$2103,'airport codes'!$C$3:$C$2103)","v":"Netherlands Antilles"},"AMS",{"$f":"_xlfn.XLOOKUP(' Flight data base'!F1052,'airport codes'!$D$3:$D$2103,'airport codes'!$C$3:$C$2103)","v":"Netherlands"},"2020-12-14",null,null,"2020-12-27",null,null,null,null,"X",null,"X","PF"]
[1052,"KLM","KL0729","SXM",{"$f":"_xlfn.XLOOKUP(' Flight data base'!D1053,'airport codes'!$D$3:$D$2103,'airport codes'!$C$3:$C$2103)","v":"Netherlands Antilles"},"AMS",{"$f":"_xlfn.XLOOKUP(' Flight data base'!F1053,'airport codes'!$D$3:$D$2103,'airport codes'!$C$3:$C$2103)","v":"Netherlands"},"2020-12-28",null,null,"2021-01-03",null,null,null,null,"X","X","X","PF"]
[1053,"AIR FRANCE","AF9270","TUN",{"$f":"_xlfn.XLOOKUP(' Flight data base'!D1054,'airport codes'!$D$3:$D$2103,'airport codes'!$C$3:$C$2103)","v":"Tunisia"},"CDG",{"$f":"_xlfn.XLOOKUP(' Flight data base'!F1054,'airport codes'!$D$3:$D$2103,'airport codes'!$C$3:$C$2103)","v":"France"},"2020-12-14",null,null,"2021-01-03",null,null,"X",null,null,null,null,"PF"]
[1054,"KLM","KL0515","ZNZ",{"$f":"_xlfn.XLOOKUP(' Flight data base'!D1055,'airport codes'!$D$3:$D$2103,'airport codes'!$C$3:$C$2103)","v":"Tanzania"},"AMS",{"$f":"_xlfn.XLOOKUP(' Flight data base'!F1055,'airport codes'!$D$3:$D$2103,'airport codes'!$C$3:$C$2103)","v":"Netherlands"},"2020-12-13",null,null,"2021-01-03",null,null,null,"X",null,null,"X","PF"]
[1055,"AIR FRANCE","AF 0934","TNR",{"$f":"_xlfn.XLOOKUP(' Flight data base'!D1056,'airport codes'!$D$3:$D$2103,'airport codes'!$C$3:$C$2103)","v":"Madagascar"},"CDG",{"$f":"_xlfn.XLOOKUP(' Flight data base'!F1056,'airport codes'!$D$3:$D$2103,'airport codes'!$C$3:$C$2103)","v":"France"},"2020-12-13",null,null,"2021-01-03",null,null,"X",null,null,"X",null,"PF"]
[1056,"AIR FRANCE","AF6902","TNR",{"$f":"_xlfn.XLOOKUP(' Flight data base'!D1057,'airport codes'!$D$3:$D$2103,'airport codes'!$C$3:$C$2103)","v":"Madagascar"},"CDG",{"$f":"_xlfn.XLOOKUP(' Flight data base'!F1057,'airport codes'!$D$3:$D$2103,'airport codes'!$C$3:$C$2103)","v":"France"},"2020-12-14",null,null,"2021-01-03",null,null,"X","X",null,"X",null,"PF"]
[1057,"AIR FRANCE","AF6908","TNR",{"$f":"_xlfn.XLOOKUP(' Flight data base'!D1058,'airport codes'!$D$3:$D$2103,'airport codes'!$C$3:$C$2103)","v":"Madagascar"},"CDG",{"$f":"_xlfn.XLOOKUP(' Flight data base'!F1058,'airport codes'!$D$3:$D$2103,'airport codes'!$C$3:$C$2103)","v":"France"},"2020-12-07",null,null,"2021-01-03","X",null,null,null,null,null,null,"FF"]
[1058,"QATAR AIRWAYS","\nQR 1348","DAR",{"$f":"_xlfn.XLOOKUP(' Flight data base'!D1059,'airport codes'!$D$3:$D$2103,'airport codes'!$C$3:$C$2103)","v":"Tanzania"},"DOH",{"$f":"_xlfn.XLOOKUP(' Flight data base'!F1059,'airport codes'!$D$3:$D$2103,'airport codes'!$C$3:$C$2103)","v":"Qatar"},"2020-12-17",2325,"0540","2021-01-10","X",null,"X",null,"X",null,null,"PF"]
[1059,"QATAR AIRWAYS","QR 1352","DAR",{"$f":"_xlfn.XLOOKUP(' Flight data base'!D1060,'airport codes'!$D$3:$D$2103,'airport codes'!$C$3:$C$2103)","v":"Tanzania"},"DOH",{"$f":"_xlfn.XLOOKUP(' Flight data base'!F1060,'airport codes'!$D$3:$D$2103,'airport codes'!$C$3:$C$2103)","v":"Qatar"},"2020-12-17","2330","0545","2021-01-10",null,"X",null,"X",null,"X","X","PF"]
[1060,"QATAR AIRWAYS","QR8702","EBB",{"$f":"_xlfn.XLOOKUP(' Flight data base'!D1061,'airport codes'!$D$3:$D$2103,'airport codes'!$C$3:$C$2103)","v":"Uganda"},"DOH",{"$f":"_xlfn.XLOOKUP(' Flight data base'!F1061,'airport codes'!$D$3:$D$2103,'airport codes'!$C$3:$C$2103)","v":"Qatar"},"2020-12-17","0720","1630","2021-01-10",null,"X",null,null,null,null,null,"FF"]
[1061,"QATAR AIRWAYS","QR1386","EBB",{"$f":"_xlfn.XLOOKUP(' Flight data base'!D1062,'airport codes'!$D$3:$D$2103,'airport codes'!$C$3:$C$2103)","v":"Uganda"},"DOH",{"$f":"_xlfn.XLOOKUP(' Flight data base'!F1062,'airport codes'!$D$3:$D$2103,'airport codes'!$C$3:$C$2103)","v":"Qatar"},"2020-12-17","2225","0445","2021-01-10","X",null,"X",null,"X",null,null,"FF"]
[1062,"QATAR AIRWAYS","QR8491","EBB",{"$f":"_xlfn.XLOOKUP(' Flight data base'!D1063,'airport codes'!$D$3:$D$2103,'airport codes'!$C$3:$C$2103)","v":"Uganda"},"DOH",{"$f":"_xlfn.XLOOKUP(' Flight data base'!F1063,'airport codes'!$D$3:$D$2103,'airport codes'!$C$3:$C$2103)","v":"Qatar"},"2021-01-04","1145","0745","2021-01-10",null,null,null,null,null,"X",null,"FF"]
[1063,"QATAR AIRWAYS","QR8781","EBB",{"$f":"_xlfn.XLOOKUP(' Flight data base'!D1064,'airport codes'!$D$3:$D$2103,'airport codes'!$C$3:$C$2103)","v":"Uganda"},"BRU",{"$f":"_xlfn.XLOOKUP(' Flight data base'!F1064,'airport codes'!$D$3:$D$2103,'airport codes'!$C$3:$C$2103)","v":"Belgium"},"2020-12-17","1050","1715","2021-01-10",null,"X",null,null,null,null,null,"FF"]
[1064,"QATAR AIRWAYS","QR8750","EBB",{"$f":"_xlfn.XLOOKUP(' Flight data base'!D1065,'airport codes'!$D$3:$D$2103,'airport codes'!$C$3:$C$2103)","v":"Uganda"},"LGG",{"$f":"_xlfn.XLOOKUP(' Flight data base'!F1065,'airport codes'!$D$3:$D$2103,'airport codes'!$C$3:$C$2103)","v":"Belgium"},"2020-12-17","0120","1140","2020-12-21","X",null,null,null,null,null,null,"FF"]
[1065,"QATAR AIRWAYS","QR8750","EBB",{"$f":"_xlfn.XLOOKUP(' Flight data base'!D1066,'airport codes'!$D$3:$D$2103,'airport codes'!$C$3:$C$2103)","v":"Uganda"},"LGG",{"$f":"_xlfn.XLOOKUP(' Flight data base'!F1066,'airport codes'!$D$3:$D$2103,'airport codes'!$C$3:$C$2103)","v":"Belgium"},"2020-12-22","2150","0820","2021-01-10",null,null,null,null,null,null,"X","FF"]
[1066,"QATAR AIRWAYS","QR8722","EBB",{"$f":"_xlfn.XLOOKUP(' Flight data base'!D1067,'airport codes'!$D$3:$D$2103,'airport codes'!$C$3:$C$2103)","v":"Uganda"},"LGG",{"$f":"_xlfn.XLOOKUP(' Flight data base'!F1067,'airport codes'!$D$3:$D$2103,'airport codes'!$C$3:$C$2103)","v":"Belgium"},"2020-12-17","1710","0320","2021-01-10",null,null,null,null,"X",null,null,"FF"]
[1067,"QATAR AIRWAYS","QR 1460","JIB",{"$f":"_xlfn.XLOOKUP(' Flight data base'!D1068,'airport codes'!$D$3:$D$2103,'airport codes'!$C$3:$C$2103)","v":"Djibouti"},"DOH",{"$f":"_xlfn.XLOOKUP(' Flight data base'!F1068,'airport codes'!$D$3:$D$2103,'airport codes'!$C$3:$C$2103)","v":"Qatar"},"2020-12-17","1915","0015","2021-01-10",null,"X",null,"X",null,"X","X","PF"]
[1068,"QATAR AIRWAYS","QR 1364","JNB",{"$f":"_xlfn.XLOOKUP(' Flight data base'!D1069,'airport codes'!$D$3:$D$2103,'airport codes'!$C$3:$C$2103)","v":"South Africa"},"DOH",{"$f":"_xlfn.XLOOKUP(' Flight data base'!F1069,'airport codes'!$D$3:$D$2103,'airport codes'!$C$3:$C$2103)","v":"Qatar"},"2020-12-17","1310","2305","2020-01-10","X","X","X","X","X","X","X","PF"]
[1069,"QATAR AIRWAYS","QR 1378","JNB",{"$f":"_xlfn.XLOOKUP(' Flight data base'!D1070,'airport codes'!$D$3:$D$2103,'airport codes'!$C$3:$C$2103)","v":"South Africa"},"DOH",{"$f":"_xlfn.XLOOKUP(' Flight data base'!F1070,'airport codes'!$D$3:$D$2103,'airport codes'!$C$3:$C$2103)","v":"Qatar"},"2020-12-17","1920","0515","2020-01-10","X","X","X","X","X","X","X","PF"]
[1070,"QATAR AIRWAYS","QR 8772","JNB",{"$f":"_xlfn.XLOOKUP(' Flight data base'!D1071,'airport codes'!$D$3:$D$2103,'airport codes'!$C$3:$C$2103)","v":"South Africa"},"DOH",{"$f":"_xlfn.XLOOKUP(' Flight data base'!F1071,'airport codes'!$D$3:$D$2103,'airport codes'!$C$3:$C$2103)","v":"Qatar"},"2020-12-17",1655,744,"2020-01-10",null,null,null,"X",null,null,null,"FF"]
[1071,"QATAR AIRWAYS","QR8721","LOS",{"$f":"_xlfn.XLOOKUP(' Flight data base'!D1072,'airport codes'!$D$3:$D$2103,'airport codes'!$C$3:$C$2103)","v":"Nigeria"},"EBB",{"$f":"_xlfn.XLOOKUP(' Flight data base'!F1072,'airport codes'!$D$3:$D$2103,'airport codes'!$C$3:$C$2103)","v":"Uganda"},"2020-12-17",855,1520,"2021-01-10",null,null,null,null,"X",null,null,"FF"]
[1072,"QATAR AIRWAYS","QR8792","LOS",{"$f":"_xlfn.XLOOKUP(' Flight data base'!D1073,'airport codes'!$D$3:$D$2103,'airport codes'!$C$3:$C$2103)","v":"Nigeria"},"EBB",{"$f":"_xlfn.XLOOKUP(' Flight data base'!F1073,'airport codes'!$D$3:$D$2103,'airport codes'!$C$3:$C$2103)","v":"Uganda"},"2020-12-17",1930,520,"2021-01-10","X",null,null,null,null,null,null,"FF"]
[1073,"QATAR AIRWAYS","QR8775","NBO",{"$f":"_xlfn.XLOOKUP(' Flight data base'!D1074,'airport codes'!$D$3:$D$2103,'airport codes'!$C$3:$C$2103)","v":"Kenya"},"LGG",{"$f":"_xlfn.XLOOKUP(' Flight data base'!F1074,'airport codes'!$D$3:$D$2103,'airport codes'!$C$3:$C$2103)","v":"Belgium"},"2020-12-17","0040","0750","2021-01-10",null,null,null,null,null,"X",null,"FF"]
[1074,"QATAR AIRWAYS","QR8750","NBO",{"$f":"_xlfn.XLOOKUP(' Flight data base'!D1075,'airport codes'!$D$3:$D$2103,'airport codes'!$C$3:$C$2103)","v":"Kenya"},"LGG",{"$f":"_xlfn.XLOOKUP(' Flight data base'!F1075,'airport codes'!$D$3:$D$2103,'airport codes'!$C$3:$C$2103)","v":"Belgium"},"2020-12-17","0420","1140","2020-12-31","X",null,null,null,null,null,null,"FF"]
[1075,"QATAR AIRWAYS","QR8776","NBO",{"$f":"_xlfn.XLOOKUP(' Flight data base'!D1076,'airport codes'!$D$3:$D$2103,'airport codes'!$C$3:$C$2103)","v":"Kenya"},"LGG",{"$f":"_xlfn.XLOOKUP(' Flight data base'!F1076,'airport codes'!$D$3:$D$2103,'airport codes'!$C$3:$C$2103)","v":"Belgium"},"2020-12-17",null,null,"2021-01-10",null,"X",null,null,null,"X",null,"FF"]
[1076,"QATAR AIRWAYS","QR8822","NBO",{"$f":"_xlfn.XLOOKUP(' Flight data base'!D1077,'airport codes'!$D$3:$D$2103,'airport codes'!$C$3:$C$2103)","v":"Kenya"},"LGG",{"$f":"_xlfn.XLOOKUP(' Flight data base'!F1077,'airport codes'!$D$3:$D$2103,'airport codes'!$C$3:$C$2103)","v":"Belgium"},"2020-12-17","2010","0320","2021-01-10",null,null,null,null,"X",null,null,"FF"]
[1077,"QATAR AIRWAYS","QR 1336 ","NBO",{"$f":"_xlfn.XLOOKUP(' Flight data base'!D1078,'airport codes'!$D$3:$D$2103,'airport codes'!$C$3:$C$2103)","v":"Kenya"},"DOH",{"$f":"_xlfn.XLOOKUP(' Flight data base'!F1078,'airport codes'!$D$3:$D$2103,'airport codes'!$C$3:$C$2103)","v":"Qatar"},"2020-12-17","1710","2315","2020-01-10","X","X","X","X","X","X","X","PF"]
[1078,"QATAR AIRWAYS","QR 1342 ","NBO",{"$f":"_xlfn.XLOOKUP(' Flight data base'!D1079,'airport codes'!$D$3:$D$2103,'airport codes'!$C$3:$C$2103)","v":"Kenya"},"DOH",{"$f":"_xlfn.XLOOKUP(' Flight data base'!F1079,'airport codes'!$D$3:$D$2103,'airport codes'!$C$3:$C$2103)","v":"Qatar"},"2020-12-17","0055","0645","2020-01-10","X","X","X","X","X","X","X","PF"]
[1079,"QATAR AIRWAYS","QR 8702 ","NBO",{"$f":"_xlfn.XLOOKUP(' Flight data base'!D1080,'airport codes'!$D$3:$D$2103,'airport codes'!$C$3:$C$2103)","v":"Kenya"},"DOH",{"$f":"_xlfn.XLOOKUP(' Flight data base'!F1080,'airport codes'!$D$3:$D$2103,'airport codes'!$C$3:$C$2103)","v":"Qatar"},"2020-12-17","0410","1010","2021-01-10",null,"X",null,null,null,null,null,"FF"]
[1080,"QATAR AIRWAYS","QR 8491","NBO",{"$f":"_xlfn.XLOOKUP(' Flight data base'!D1081,'airport codes'!$D$3:$D$2103,'airport codes'!$C$3:$C$2103)","v":"Kenya"},"DOH",{"$f":"_xlfn.XLOOKUP(' Flight data base'!F1081,'airport codes'!$D$3:$D$2103,'airport codes'!$C$3:$C$2103)","v":"Qatar"},"2020-12-17","1435","0745","2021-01-10",null,null,null,null,null,"X",null,"FF"]
[1081,"QATAR AIRWAYS","QR 8772","NBO",{"$f":"_xlfn.XLOOKUP(' Flight data base'!D1082,'airport codes'!$D$3:$D$2103,'airport codes'!$C$3:$C$2103)","v":"Kenya"},"DOH",{"$f":"_xlfn.XLOOKUP(' Flight data base'!F1082,'airport codes'!$D$3:$D$2103,'airport codes'!$C$3:$C$2103)","v":"Qatar"},"2020-12-17","0040","0640","2021-01-10",null,null,null,null,"X",null,null,"FF"]
[1082,null,"QR1361","MPM",{"$f":"_xlfn.XLOOKUP(' Flight data base'!D1083,'airport codes'!$D$3:$D$2103,'airport codes'!$C$3:$C$2103)","v":"Mozambique"},"DOH",{"$f":"_xlfn.XLOOKUP(' Flight data base'!F1083,'airport codes'!$D$3:$D$2103,'airport codes'!$C$3:$C$2103)","v":"Qatar"},"2020-11-01",null,null,null,"X",null,null,"X",null,null,null,"PF"]
[1083,null,"QR1352","ZNZ",{"$f":"_xlfn.XLOOKUP(' Flight data base'!D1084,'airport codes'!$D$3:$D$2103,'airport codes'!$C$3:$C$2103)","v":"Tanzania"},"DOH",{"$f":"_xlfn.XLOOKUP(' Flight data base'!F1084,'airport codes'!$D$3:$D$2103,'airport codes'!$C$3:$C$2103)","v":"Qatar"},"2020-11-01",null,null,null,null,"X",null,"X",null,"X","X","PF"]
[1084,"QATAR AIRWAYS","QR1386","KGL",{"$f":"_xlfn.XLOOKUP(' Flight data base'!D1085,'airport codes'!$D$3:$D$2103,'airport codes'!$C$3:$C$2103)","v":"Rwanda"},"EBB",{"$f":"_xlfn.XLOOKUP(' Flight data base'!F1085,'airport codes'!$D$3:$D$2103,'airport codes'!$C$3:$C$2103)","v":"Uganda"},"2020-12-17","1915","2115","2021-01-10","X",null,"X",null,"X",null,null,"PF"]
[1085,"QATAR AIRWAYS","QR 8701","KGL",{"$f":"_xlfn.XLOOKUP(' Flight data base'!D1086,'airport codes'!$D$3:$D$2103,'airport codes'!$C$3:$C$2103)","v":"Rwanda"},"EBB",{"$f":"_xlfn.XLOOKUP(' Flight data base'!F1086,'airport codes'!$D$3:$D$2103,'airport codes'!$C$3:$C$2103)","v":"Uganda"},"2020-12-17","0710","0910","2021-01-10",null,"X",null,null,null,null,null,"FF"]
[1086,"QATAR AIRWAYS","QR8490","KGL",{"$f":"_xlfn.XLOOKUP(' Flight data base'!D1087,'airport codes'!$D$3:$D$2103,'airport codes'!$C$3:$C$2103)","v":"Rwanda"},"EBB",{"$f":"_xlfn.XLOOKUP(' Flight data base'!F1087,'airport codes'!$D$3:$D$2103,'airport codes'!$C$3:$C$2103)","v":"Uganda"},"2021-01-04","0815","1015","2021-01-10",null,null,null,null,null,"X",null,"FF"]
[1087,"RWANDAIR","WB700","KGL",{"$f":"_xlfn.XLOOKUP(' Flight data base'!D1088,'airport codes'!$D$3:$D$2103,'airport codes'!$C$3:$C$2103)","v":"Rwanda"},"BRU",{"$f":"_xlfn.XLOOKUP(' Flight data base'!F1088,'airport codes'!$D$3:$D$2103,'airport codes'!$C$3:$C$2103)","v":"Belgium"},"2020-12-02",2359,"0750","2020-12-21","X",null,"X",null,"X",null,null,"PF"]
[1088,"RWANDAIR","WB700","BRU",{"$f":"_xlfn.XLOOKUP(' Flight data base'!D1089,'airport codes'!$D$3:$D$2103,'airport codes'!$C$3:$C$2103)","v":"Belgium"},"LHR",{"$f":"_xlfn.XLOOKUP(' Flight data base'!F1089,'airport codes'!$D$3:$D$2103,'airport codes'!$C$3:$C$2103)","v":"United Kingdom"},"2020-12-02","0910","0925","2020-12-21",null,"X",null,"X",null,"X",null,"PF"]
[1089,"RWANDAIR","WB701","LHR",{"$f":"_xlfn.XLOOKUP(' Flight data base'!D1090,'airport codes'!$D$3:$D$2103,'airport codes'!$C$3:$C$2103)","v":"United Kingdom"},"BRU",{"$f":"_xlfn.XLOOKUP(' Flight data base'!F1090,'airport codes'!$D$3:$D$2103,'airport codes'!$C$3:$C$2103)","v":"Belgium"},"2020-12-02","1705","1905","2020-10-31",null,"X",null,"X",null,"X",null,"PF"]
[1090,"RWANDAIR","WB701","BRU",{"$f":"_xlfn.XLOOKUP(' Flight data base'!D1091,'airport codes'!$D$3:$D$2103,'airport codes'!$C$3:$C$2103)","v":"Belgium"},"KGL",{"$f":"_xlfn.XLOOKUP(' Flight data base'!F1091,'airport codes'!$D$3:$D$2103,'airport codes'!$C$3:$C$2103)","v":"Rwanda"},"2020-12-02","2030","0600","2020-10-31",null,"X",null,"X",null,"X",null,"PF"]
[1091,"TURKISH AIRWAYS",null,"ALG",{"$f":"_xlfn.XLOOKUP(' Flight data base'!D1092,'airport codes'!$D$3:$D$2103,'airport codes'!$C$3:$C$2103)","v":"Algeria"},"IST",{"$f":"_xlfn.XLOOKUP(' Flight data base'!F1092,'airport codes'!$D$3:$D$2103,'airport codes'!$C$3:$C$2103)","v":"Turkey"},"2020-12-01",null,null,"2020-12-31","X","X","X",null,"X","X","X","FF"]
[1092,"TURKISH AIRWAYS",null,"COO",{"$f":"_xlfn.XLOOKUP(' Flight data base'!D1093,'airport codes'!$D$3:$D$2103,'airport codes'!$C$3:$C$2103)","v":"Benin"},"IST",{"$f":"_xlfn.XLOOKUP(' Flight data base'!F1093,'airport codes'!$D$3:$D$2103,'airport codes'!$C$3:$C$2103)","v":"Turkey"},"2020-12-01",null,null,"2020-12-31",null,null,null,null,null,null,"X","PF"]
[1093,"TURKISH AIRWAYS",null,"OUA",{"$f":"_xlfn.XLOOKUP(' Flight data base'!D1094,'airport codes'!$D$3:$D$2103,'airport codes'!$C$3:$C$2103)","v":"Burkina Faso"},"IST",{"$f":"_xlfn.XLOOKUP(' Flight data base'!F1094,'airport codes'!$D$3:$D$2103,'airport codes'!$C$3:$C$2103)","v":"Turkey"},"2020-12-01",null,null,"2020-12-31","X",null,null,null,null,null,null,"PF"]
[1094,"TURKISH AIRWAYS",null,"DLA",{"$f":"_xlfn.XLOOKUP(' Flight data base'!D1095,'airport codes'!$D$3:$D$2103,'airport codes'!$C$3:$C$2103)","v":"Cameroon"},"IST",{"$f":"_xlfn.XLOOKUP(' Flight data base'!F1095,'airport codes'!$D$3:$D$2103,'airport codes'!$C$3:$C$2103)","v":"Turkey"},"2020-12-01",null,null,"2020-12-31","X",null,null,null,null,null,"X","PF"]
[1095,"TURKISH AIRWAYS",null,"NSI",{"$f":"_xlfn.XLOOKUP(' Flight data base'!D1096,'airport codes'!$D$3:$D$2103,'airport codes'!$C$3:$C$2103)","v":"Cameroon"},"IST",{"$f":"_xlfn.XLOOKUP(' Flight data base'!F1096,'airport codes'!$D$3:$D$2103,'airport codes'!$C$3:$C$2103)","v":"Turkey"},"2020-12-01",null,null,"2020-12-31","X",null,null,null,null,null,"X","PF"]
[1096,"TURKISH AIRWAYS",null,"NDJ",{"$f":"_xlfn.XLOOKUP(' Flight data base'!D1097,'airport codes'!$D$3:$D$2103,'airport codes'!$C$3:$C$2103)","v":"Chad"},"IST",{"$f":"_xlfn.XLOOKUP(' Flight data base'!F1097,'airport codes'!$D$3:$D$2103,'airport codes'!$C$3:$C$2103)","v":"Turkey"},"2020-12-01",null,null,"2020-12-31",null,null,null,null,null,null,"X","PF"]
[1097,"TURKISH AIRWAYS",null,"ABJ",{"$f":"_xlfn.XLOOKUP(' Flight data base'!D1098,'airport codes'!$D$3:$D$2103,'airport codes'!$C$3:$C$2103)","v":"Cote d'Ivoire"},"IST",{"$f":"_xlfn.XLOOKUP(' Flight data base'!F1098,'airport codes'!$D$3:$D$2103,'airport codes'!$C$3:$C$2103)","v":"Turkey"},"2020-12-01",null,null,"2020-12-31",null,null,null,null,null,null,"X","PF"]
[1098,"TURKISH AIRWAYS",null,"CAI",{"$f":"_xlfn.XLOOKUP(' Flight data base'!D1099,'airport codes'!$D$3:$D$2103,'airport codes'!$C$3:$C$2103)","v":"Egypt"},"IST",{"$f":"_xlfn.XLOOKUP(' Flight data base'!F1099,'airport codes'!$D$3:$D$2103,'airport codes'!$C$3:$C$2103)","v":"Turkey"},"2020-12-01",null,null,"2020-12-31",null,"X",null,null,"X",null,null,"FF"]
[1099,"TURKISH AIRWAYS",null,"ADD",{"$f":"_xlfn.XLOOKUP(' Flight data base'!D1100,'airport codes'!$D$3:$D$2103,'airport codes'!$C$3:$C$2103)","v":"Ethiopia"},"IST",{"$f":"_xlfn.XLOOKUP(' Flight data base'!F1100,'airport codes'!$D$3:$D$2103,'airport codes'!$C$3:$C$2103)","v":"Turkey"},"2020-12-01",null,null,"2020-12-31",null,null,null,null,null,null,"X","FF"]
[1100,"TURKISH AIRWAYS",null,"BJL",{"$f":"_xlfn.XLOOKUP(' Flight data base'!D1101,'airport codes'!$D$3:$D$2103,'airport codes'!$C$3:$C$2103)","v":"Gambia"},"IST",{"$f":"_xlfn.XLOOKUP(' Flight data base'!F1101,'airport codes'!$D$3:$D$2103,'airport codes'!$C$3:$C$2103)","v":"Turkey"},"2020-12-01",null,null,"2020-12-31",null,null,null,null,null,"X",null,"PF"]
[1101,"TURKISH AIRWAYS",null,"ACC",{"$f":"_xlfn.XLOOKUP(' Flight data base'!D1102,'airport codes'!$D$3:$D$2103,'airport codes'!$C$3:$C$2103)","v":"Ghana"},"IST",{"$f":"_xlfn.XLOOKUP(' Flight data base'!F1102,'airport codes'!$D$3:$D$2103,'airport codes'!$C$3:$C$2103)","v":"Turkey"},"2020-12-01",null,null,"2020-12-31",null,"X",null,null,"X",null,null,"FF"]
[1102,"TURKISH AIRWAYS",null,"NBO",{"$f":"_xlfn.XLOOKUP(' Flight data base'!D1103,'airport codes'!$D$3:$D$2103,'airport codes'!$C$3:$C$2103)","v":"Kenya"},"IST",{"$f":"_xlfn.XLOOKUP(' Flight data base'!F1103,'airport codes'!$D$3:$D$2103,'airport codes'!$C$3:$C$2103)","v":"Turkey"},"2020-12-01",null,null,"2020-12-31","X","X","X","X",null,"X",null,"FF"]
[1103,"TURKISH AIRWAYS",null,"NBO",{"$f":"_xlfn.XLOOKUP(' Flight data base'!D1104,'airport codes'!$D$3:$D$2103,'airport codes'!$C$3:$C$2103)","v":"Kenya"},"IST",{"$f":"_xlfn.XLOOKUP(' Flight data base'!F1104,'airport codes'!$D$3:$D$2103,'airport codes'!$C$3:$C$2103)","v":"Turkey"},"2020-12-01",null,null,"2020-12-31",null,"X",null,null,null,"X",null,"FF"]
[1104,"TURKISH AIRWAYS",null,"TNR",{"$f":"_xlfn.XLOOKUP(' Flight data base'!D1105,'airport codes'!$D$3:$D$2103,'airport codes'!$C$3:$C$2103)","v":"Madagascar"},"IST",{"$f":"_xlfn.XLOOKUP(' Flight data base'!F1105,'airport codes'!$D$3:$D$2103,'airport codes'!$C$3:$C$2103)","v":"Turkey"},"2020-12-01",null,null,"2020-12-31",null,null,null,null,null,"X",null,"FF"]
[1105,"TURKISH AIRWAYS",null,"TNR",{"$f":"_xlfn.XLOOKUP(' Flight data base'!D1106,'airport codes'!$D$3:$D$2103,'airport codes'!$C$3:$C$2103)","v":"Madagascar"},"IST",{"$f":"_xlfn.XLOOKUP(' Flight data base'!F1106,'airport codes'!$D$3:$D$2103,'airport codes'!$C$3:$C$2103)","v":"Turkey"},"2020-12-01",null,null,"2020-12-31","X",null,null,null,null,null,null,"FF"]
[1106,"TURKISH AIRWAYS",null,"CMN",{"$f":"_xlfn.XLOOKUP(' Flight data base'!D1107,'airport codes'!$D$3:$D$2103,'airport codes'!$C$3:$C$2103)","v":"Morocco"},"IST",{"$f":"_xlfn.XLOOKUP(' Flight data base'!F1107,'airport codes'!$D$3:$D$2103,'airport codes'!$C$3:$C$2103)","v":"Turkey"},"2020-12-01",null,null,"2020-12-31","X",null,null,null,null,null,null,"FF"]
[1107,"TURKISH AIRWAYS",null,"CMN",{"$f":"_xlfn.XLOOKUP(' Flight data base'!D1108,'airport codes'!$D$3:$D$2103,'airport codes'!$C$3:$C$2103)","v":"Morocco"},"IST",{"$f":"_xlfn.XLOOKUP(' Flight data base'!F1108,'airport codes'!$D$3:$D$2103,'airport codes'!$C$3:$C$2103)","v":"Turkey"},"2020-12-01",null,null,"2020-12-31","X",null,"X",null,"X",null,"X","PF"]
[1108,"TURKISH AIRWAYS",null,"NKC",{"$f":"_xlfn.XLOOKUP(' Flight data base'!D1109,'airport codes'!$D$3:$D$2103,'airport codes'!$C$3:$C$2103)","v":"Mauritania"},"IST",{"$f":"_xlfn.XLOOKUP(' Flight data base'!F1109,'airport codes'!$D$3:$D$2103,'airport codes'!$C$3:$C$2103)","v":"Turkey"},"2020-12-01",null,null,"2020-12-31",null,null,null,null,"X",null,null,"FF"]
[1109,"TURKISH AIRWAYS",null,"MRU",{"$f":"_xlfn.XLOOKUP(' Flight data base'!D1110,'airport codes'!$D$3:$D$2103,'airport codes'!$C$3:$C$2103)","v":"Mauritius"},"IST",{"$f":"_xlfn.XLOOKUP(' Flight data base'!F1110,'airport codes'!$D$3:$D$2103,'airport codes'!$C$3:$C$2103)","v":"Turkey"},"2020-12-01",null,null,"2020-12-31",null,null,null,"X",null,null,null,"FF"]
[1110,"TURKISH AIRWAYS",null,"WDH",{"$f":"_xlfn.XLOOKUP(' Flight data base'!D1111,'airport codes'!$D$3:$D$2103,'airport codes'!$C$3:$C$2103)","v":"Namibia"},"IST",{"$f":"_xlfn.XLOOKUP(' Flight data base'!F1111,'airport codes'!$D$3:$D$2103,'airport codes'!$C$3:$C$2103)","v":"Turkey"},"2020-12-01",null,null,"2020-12-31","X",null,null,null,null,null,null,"PF"]
[1111,"TURKISH AIRWAYS",null,"KAN",{"$f":"_xlfn.XLOOKUP(' Flight data base'!D1112,'airport codes'!$D$3:$D$2103,'airport codes'!$C$3:$C$2103)","v":"Nigeria"},"IST",{"$f":"_xlfn.XLOOKUP(' Flight data base'!F1112,'airport codes'!$D$3:$D$2103,'airport codes'!$C$3:$C$2103)","v":"Turkey"},"2020-12-01",null,null,"2020-12-31",null,"X",null,null,null,null,null,"FF"]
[1112,"TURKISH AIRWAYS",null,"LOS",{"$f":"_xlfn.XLOOKUP(' Flight data base'!D1113,'airport codes'!$D$3:$D$2103,'airport codes'!$C$3:$C$2103)","v":"Nigeria"},"IST",{"$f":"_xlfn.XLOOKUP(' Flight data base'!F1113,'airport codes'!$D$3:$D$2103,'airport codes'!$C$3:$C$2103)","v":"Turkey"},"2020-12-01",null,null,"2020-12-31",null,"X",null,null,"X",null,"X","FF"]
[1113,"TURKISH AIRWAYS",null,"LOS",{"$f":"_xlfn.XLOOKUP(' Flight data base'!D1114,'airport codes'!$D$3:$D$2103,'airport codes'!$C$3:$C$2103)","v":"Nigeria"},"IST",{"$f":"_xlfn.XLOOKUP(' Flight data base'!F1114,'airport codes'!$D$3:$D$2103,'airport codes'!$C$3:$C$2103)","v":"Turkey"},"2020-12-01",null,null,"2020-12-31",null,"X",null,null,null,null,null,"FF"]
[1114,"TURKISH AIRWAYS",null,"LOS",{"$f":"_xlfn.XLOOKUP(' Flight data base'!D1115,'airport codes'!$D$3:$D$2103,'airport codes'!$C$3:$C$2103)","v":"Nigeria"},"IST",{"$f":"_xlfn.XLOOKUP(' Flight data base'!F1115,'airport codes'!$D$3:$D$2103,'airport codes'!$C$3:$C$2103)","v":"Turkey"},"2020-12-01",null,null,"2020-12-31",null,"X","X","X","X","X","X","PF"]
[1115,"TURKISH AIRWAYS",null,"ABV",{"$f":"_xlfn.XLOOKUP(' Flight data base'!D1116,'airport codes'!$D$3:$D$2103,'airport codes'!$C$3:$C$2103)","v":"Nigeria"},"IST",{"$f":"_xlfn.XLOOKUP(' Flight data base'!F1116,'airport codes'!$D$3:$D$2103,'airport codes'!$C$3:$C$2103)","v":"Turkey"},"2020-12-01",null,null,"2020-12-31",null,null,null,"X",null,null,"X","PF"]
[1116,"TURKISH AIRWAYS",null,"EBB",{"$f":"_xlfn.XLOOKUP(' Flight data base'!D1117,'airport codes'!$D$3:$D$2103,'airport codes'!$C$3:$C$2103)","v":"Uganda"},"IST",{"$f":"_xlfn.XLOOKUP(' Flight data base'!F1117,'airport codes'!$D$3:$D$2103,'airport codes'!$C$3:$C$2103)","v":"Turkey"},"2020-12-01",null,null,"2020-12-31","X",null,null,"X",null,"X","X","FF"]
[1117,"TURKISH AIRWAYS",null,"EBB",{"$f":"_xlfn.XLOOKUP(' Flight data base'!D1118,'airport codes'!$D$3:$D$2103,'airport codes'!$C$3:$C$2103)","v":"Uganda"},"IST",{"$f":"_xlfn.XLOOKUP(' Flight data base'!F1118,'airport codes'!$D$3:$D$2103,'airport codes'!$C$3:$C$2103)","v":"Turkey"},"2020-12-01",null,null,"2020-12-31",null,null,"X",null,null,"X",null,"PF"]
[1118,"TURKISH AIRWAYS",null,"FIH",{"$f":"_xlfn.XLOOKUP(' Flight data base'!D1119,'airport codes'!$D$3:$D$2103,'airport codes'!$C$3:$C$2103)","v":"Congo (DRC)"},"IST",{"$f":"_xlfn.XLOOKUP(' Flight data base'!F1119,'airport codes'!$D$3:$D$2103,'airport codes'!$C$3:$C$2103)","v":"Turkey"},"2020-12-01",null,null,"2020-12-31",null,null,"X",null,null,null,null,"FF"]
[1119,"TURKISH AIRWAYS",null,"FIH",{"$f":"_xlfn.XLOOKUP(' Flight data base'!D1120,'airport codes'!$D$3:$D$2103,'airport codes'!$C$3:$C$2103)","v":"Congo (DRC)"},"IST",{"$f":"_xlfn.XLOOKUP(' Flight data base'!F1120,'airport codes'!$D$3:$D$2103,'airport codes'!$C$3:$C$2103)","v":"Turkey"},"2020-12-01",null,null,"2020-12-31",null,null,null,null,null,null,"X","PF"]
[1120,"TURKISH AIRWAYS",null,"DSS",{"$f":"_xlfn.XLOOKUP(' Flight data base'!D1121,'airport codes'!$D$3:$D$2103,'airport codes'!$C$3:$C$2103)","v":"Senegal"},"IST",{"$f":"_xlfn.XLOOKUP(' Flight data base'!F1121,'airport codes'!$D$3:$D$2103,'airport codes'!$C$3:$C$2103)","v":"Turkey"},"2020-12-01",null,null,"2020-12-31",null,"X",null,null,null,null,"X","FF"]
[1121,"TURKISH AIRWAYS",null,"DSS",{"$f":"_xlfn.XLOOKUP(' Flight data base'!D1122,'airport codes'!$D$3:$D$2103,'airport codes'!$C$3:$C$2103)","v":"Senegal"},"IST",{"$f":"_xlfn.XLOOKUP(' Flight data base'!F1122,'airport codes'!$D$3:$D$2103,'airport codes'!$C$3:$C$2103)","v":"Turkey"},"2020-12-01",null,null,"2020-12-31",null,null,"X",null,null,null,"X","FF"]
[1122,"TURKISH AIRWAYS",null,"DSS",{"$f":"_xlfn.XLOOKUP(' Flight data base'!D1123,'airport codes'!$D$3:$D$2103,'airport codes'!$C$3:$C$2103)","v":"Senegal"},"IST",{"$f":"_xlfn.XLOOKUP(' Flight data base'!F1123,'airport codes'!$D$3:$D$2103,'airport codes'!$C$3:$C$2103)","v":"Turkey"},"2020-12-01",null,null,"2020-12-31",null,null,null,null,"X","X",null,"PF"]
[1123,"TURKISH AIRWAYS",null,"KRT",{"$f":"_xlfn.XLOOKUP(' Flight data base'!D1124,'airport codes'!$D$3:$D$2103,'airport codes'!$C$3:$C$2103)","v":"Sudan"},"IST",{"$f":"_xlfn.XLOOKUP(' Flight data base'!F1124,'airport codes'!$D$3:$D$2103,'airport codes'!$C$3:$C$2103)","v":"Turkey"},"2020-12-01",null,null,"2020-12-31","X",null,null,null,null,"X",null,"FF"]
[1124,"TURKISH AIRWAYS",null,"JNB",{"$f":"_xlfn.XLOOKUP(' Flight data base'!D1125,'airport codes'!$D$3:$D$2103,'airport codes'!$C$3:$C$2103)","v":"South Africa"},"IST",{"$f":"_xlfn.XLOOKUP(' Flight data base'!F1125,'airport codes'!$D$3:$D$2103,'airport codes'!$C$3:$C$2103)","v":"Turkey"},"2020-12-01",null,null,"2020-12-31",null,null,null,"X",null,null,"X","FF"]
[1125,"TURKISH AIRWAYS",null,"JNB",{"$f":"_xlfn.XLOOKUP(' Flight data base'!D1126,'airport codes'!$D$3:$D$2103,'airport codes'!$C$3:$C$2103)","v":"South Africa"},"IST",{"$f":"_xlfn.XLOOKUP(' Flight data base'!F1126,'airport codes'!$D$3:$D$2103,'airport codes'!$C$3:$C$2103)","v":"Turkey"},"2020-12-01",null,null,"2020-12-31","XX","XX","X",null,"X",null,null,"PF"]
[1126,"TURKISH AIRWAYS",null,"CPT",{"$f":"_xlfn.XLOOKUP(' Flight data base'!D1127,'airport codes'!$D$3:$D$2103,'airport codes'!$C$3:$C$2103)","v":"South Africa"},"IST",{"$f":"_xlfn.XLOOKUP(' Flight data base'!F1127,'airport codes'!$D$3:$D$2103,'airport codes'!$C$3:$C$2103)","v":"Turkey"},"2020-12-01",null,null,"2020-12-31",null,"X",null,"X",null,null,null,"PF"]
[1127,"TURKISH AIRWAYS",null,"TUN",{"$f":"_xlfn.XLOOKUP(' Flight data base'!D1128,'airport codes'!$D$3:$D$2103,'airport codes'!$C$3:$C$2103)","v":"Tunisia"},"IST",{"$f":"_xlfn.XLOOKUP(' Flight data base'!F1128,'airport codes'!$D$3:$D$2103,'airport codes'!$C$3:$C$2103)","v":"Turkey"},"2020-12-01",null,null,"2020-12-31",null,null,"X","X",null,null,"X","FF"]
[1128,"TURKISH AIRWAYS",null,"IST",{"$f":"_xlfn.XLOOKUP(' Flight data base'!D1129,'airport codes'!$D$3:$D$2103,'airport codes'!$C$3:$C$2103)","v":"Turkey"},"BRU",{"$f":"_xlfn.XLOOKUP(' Flight data base'!F1129,'airport codes'!$D$3:$D$2103,'airport codes'!$C$3:$C$2103)","v":"Belgium"},"2020-12-01",null,null,"2020-12-31",null,"X",null,null,null,null,null,"FF"]
[1129,"TURKISH AIRWAYS",null,"IST",{"$f":"_xlfn.XLOOKUP(' Flight data base'!D1130,'airport codes'!$D$3:$D$2103,'airport codes'!$C$3:$C$2103)","v":"Turkey"},"BRU",{"$f":"_xlfn.XLOOKUP(' Flight data base'!F1130,'airport codes'!$D$3:$D$2103,'airport codes'!$C$3:$C$2103)","v":"Belgium"},"2020-12-01",null,null,"2020-12-31",null,null,null,"X",null,"X",null,"FF"]
[1130,"TURKISH AIRWAYS",null,"IST",{"$f":"_xlfn.XLOOKUP(' Flight data base'!D1131,'airport codes'!$D$3:$D$2103,'airport codes'!$C$3:$C$2103)","v":"Turkey"},"LGG",{"$f":"_xlfn.XLOOKUP(' Flight data base'!F1131,'airport codes'!$D$3:$D$2103,'airport codes'!$C$3:$C$2103)","v":"Belgium"},"2020-12-01",null,null,"2020-12-31",null,"X",null,null,"X",null,null,"FF"]
[1131,"TURKISH AIRWAYS",null,"IST",{"$f":"_xlfn.XLOOKUP(' Flight data base'!D1132,'airport codes'!$D$3:$D$2103,'airport codes'!$C$3:$C$2103)","v":"Turkey"},"CDG",{"$f":"_xlfn.XLOOKUP(' Flight data base'!F1132,'airport codes'!$D$3:$D$2103,'airport codes'!$C$3:$C$2103)","v":"France"},"2020-12-01",null,null,"2020-12-31",null,null,"X",null,"X","X",null,"FF"]
[1132,"TURKISH AIRWAYS",null,"IST",{"$f":"_xlfn.XLOOKUP(' Flight data base'!D1133,'airport codes'!$D$3:$D$2103,'airport codes'!$C$3:$C$2103)","v":"Turkey"},"CDG",{"$f":"_xlfn.XLOOKUP(' Flight data base'!F1133,'airport codes'!$D$3:$D$2103,'airport codes'!$C$3:$C$2103)","v":"France"},"2020-12-01",null,null,"2020-12-31",null,null,null,"X",null,null,null,"PF"]
[1133,"TURKISH AIRWAYS",null,"IST",{"$f":"_xlfn.XLOOKUP(' Flight data base'!D1134,'airport codes'!$D$3:$D$2103,'airport codes'!$C$3:$C$2103)","v":"Turkey"},"FRA",{"$f":"_xlfn.XLOOKUP(' Flight data base'!F1134,'airport codes'!$D$3:$D$2103,'airport codes'!$C$3:$C$2103)","v":"Germany"},"2020-12-01",null,null,"2020-12-31","X","X","X","X","X","XX","XX","FF"]
[1134,"TURKISH AIRWAYS",null,"IST",{"$f":"_xlfn.XLOOKUP(' Flight data base'!D1135,'airport codes'!$D$3:$D$2103,'airport codes'!$C$3:$C$2103)","v":"Turkey"},"FRA",{"$f":"_xlfn.XLOOKUP(' Flight data base'!F1135,'airport codes'!$D$3:$D$2103,'airport codes'!$C$3:$C$2103)","v":"Germany"},"2020-12-01",null,null,"2020-12-31","X","X","X","X","X","X","X","PF"]
[1135,"TURKISH AIRWAYS",null,"IST",{"$f":"_xlfn.XLOOKUP(' Flight data base'!D1136,'airport codes'!$D$3:$D$2103,'airport codes'!$C$3:$C$2103)","v":"Turkey"},"MXP",{"$f":"_xlfn.XLOOKUP(' Flight data base'!F1136,'airport codes'!$D$3:$D$2103,'airport codes'!$C$3:$C$2103)","v":"Italy"},"2020-12-01",null,null,"2020-12-31","X",null,"X","X","X","X",null,"FF"]
[1136,"TURKISH AIRWAYS",null,"IST",{"$f":"_xlfn.XLOOKUP(' Flight data base'!D1137,'airport codes'!$D$3:$D$2103,'airport codes'!$C$3:$C$2103)","v":"Turkey"},"AMS",{"$f":"_xlfn.XLOOKUP(' Flight data base'!F1137,'airport codes'!$D$3:$D$2103,'airport codes'!$C$3:$C$2103)","v":"Netherlands"},"2020-12-01",null,null,"2020-12-31",null,null,null,"X",null,null,"X","FF"]
[1137,"TURKISH AIRWAYS",null,"IST",{"$f":"_xlfn.XLOOKUP(' Flight data base'!D1138,'airport codes'!$D$3:$D$2103,'airport codes'!$C$3:$C$2103)","v":"Turkey"},"AMS",{"$f":"_xlfn.XLOOKUP(' Flight data base'!F1138,'airport codes'!$D$3:$D$2103,'airport codes'!$C$3:$C$2103)","v":"Netherlands"},"2020-12-01",null,null,"2020-12-31","X","X","X","X","X","X","X","PF"]
[1138,"TURKISH AIRWAYS",null,"IST",{"$f":"_xlfn.XLOOKUP(' Flight data base'!D1139,'airport codes'!$D$3:$D$2103,'airport codes'!$C$3:$C$2103)","v":"Turkey"},"MST",{"$f":"_xlfn.XLOOKUP(' Flight data base'!F1139,'airport codes'!$D$3:$D$2103,'airport codes'!$C$3:$C$2103)","v":"Netherlands"},"2020-12-01",null,null,"2020-12-31",null,"XX","XX","X","XXX","X","X","FF"]
[1139,"TURKISH AIRWAYS",null,"IST",{"$f":"_xlfn.XLOOKUP(' Flight data base'!D1140,'airport codes'!$D$3:$D$2103,'airport codes'!$C$3:$C$2103)","v":"Turkey"},"OPO",{"$f":"_xlfn.XLOOKUP(' Flight data base'!F1140,'airport codes'!$D$3:$D$2103,'airport codes'!$C$3:$C$2103)","v":"Portugal"},"2020-12-01",null,null,"2020-12-31"," "," ",null," "," ","X"," ","FF"]
[1140,"TURKISH AIRWAYS",null,"IST",{"$f":"_xlfn.XLOOKUP(' Flight data base'!D1141,'airport codes'!$D$3:$D$2103,'airport codes'!$C$3:$C$2103)","v":"Turkey"},"BCN",{"$f":"_xlfn.XLOOKUP(' Flight data base'!F1141,'airport codes'!$D$3:$D$2103,'airport codes'!$C$3:$C$2103)","v":"Spain"},"2020-12-01",null,null,"2020-12-31"," "," ","X","X",null,"X","X","FF"]
[1141,"TURKISH AIRWAYS",null,"IST",{"$f":"_xlfn.XLOOKUP(' Flight data base'!D1142,'airport codes'!$D$3:$D$2103,'airport codes'!$C$3:$C$2103)","v":"Turkey"},"MAD",{"$f":"_xlfn.XLOOKUP(' Flight data base'!F1142,'airport codes'!$D$3:$D$2103,'airport codes'!$C$3:$C$2103)","v":"Spain"},"2020-12-01",null,null,"2020-12-31"," ","X","X","X","X","X"," ","FF"]
[1142,"TURKISH AIRWAYS",null,"IST",{"$f":"_xlfn.XLOOKUP(' Flight data base'!D1143,'airport codes'!$D$3:$D$2103,'airport codes'!$C$3:$C$2103)","v":"Turkey"},"BSL",{"$f":"_xlfn.XLOOKUP(' Flight data base'!F1143,'airport codes'!$D$3:$D$2103,'airport codes'!$C$3:$C$2103)","v":"Switzerland"},"2020-12-01",null,null,"2020-12-31"," "," ","X","X"," ","X"," ","FF"]
[1143,"TURKISH AIRWAYS",null,"IST",{"$f":"_xlfn.XLOOKUP(' Flight data base'!D1144,'airport codes'!$D$3:$D$2103,'airport codes'!$C$3:$C$2103)","v":"Turkey"},"ZRH",{"$f":"_xlfn.XLOOKUP(' Flight data base'!F1144,'airport codes'!$D$3:$D$2103,'airport codes'!$C$3:$C$2103)","v":"Switzerland"},"2020-12-01",null,null,"2020-12-31"," "," ","X",null,"X","X"," ","FF"]
[1144,"BRITISH AIRWAYS","BA78","ACC",{"$f":"_xlfn.XLOOKUP(' Flight data base'!D1145,'airport codes'!$D$3:$D$2103,'airport codes'!$C$3:$C$2103)","v":"Ghana"},"LHR",{"$f":"_xlfn.XLOOKUP(' Flight data base'!F1145,'airport codes'!$D$3:$D$2103,'airport codes'!$C$3:$C$2103)","v":"United Kingdom"},"2020-12-01","22H55","5H30",null,"X","X","X","X","X","X","X","PF"]
[1145,"BRITISH AIRWAYS","BA154","CAI",{"$f":"_xlfn.XLOOKUP(' Flight data base'!D1146,'airport codes'!$D$3:$D$2103,'airport codes'!$C$3:$C$2103)","v":"Egypt"},"LHR",{"$f":"_xlfn.XLOOKUP(' Flight data base'!F1146,'airport codes'!$D$3:$D$2103,'airport codes'!$C$3:$C$2103)","v":"United Kingdom"},"2020-12-01",null,null,null,"X","X","X","X","X","X","X","PF"]
[1146,"BRITISH AIRWAYS","BA1054","JNB",{"$f":"_xlfn.XLOOKUP(' Flight data base'!D1147,'airport codes'!$D$3:$D$2103,'airport codes'!$C$3:$C$2103)","v":"South Africa"},"LHR",{"$f":"_xlfn.XLOOKUP(' Flight data base'!F1147,'airport codes'!$D$3:$D$2103,'airport codes'!$C$3:$C$2103)","v":"United Kingdom"},"2020-12-01","22H15","7H35",null,"X","X","X","X","X","X","X","PF"]
[1147,"BRITISH AIRWAYS","BA74","LOS",{"$f":"_xlfn.XLOOKUP(' Flight data base'!D1148,'airport codes'!$D$3:$D$2103,'airport codes'!$C$3:$C$2103)","v":"Nigeria"},"LHR",{"$f":"_xlfn.XLOOKUP(' Flight data base'!F1148,'airport codes'!$D$3:$D$2103,'airport codes'!$C$3:$C$2103)","v":"United Kingdom"},"2020-12-01","23H15","4H50",null,"X","X","X","X","X","X","X","PF"]
[1148,"BRITISH AIRWAYS","BA64","NBO",{"$f":"_xlfn.XLOOKUP(' Flight data base'!D1149,'airport codes'!$D$3:$D$2103,'airport codes'!$C$3:$C$2103)","v":"Kenya"},"LHR",{"$f":"_xlfn.XLOOKUP(' Flight data base'!F1149,'airport codes'!$D$3:$D$2103,'airport codes'!$C$3:$C$2103)","v":"United Kingdom"},"2020-12-01","23H55","6H15",null,"X","X",null,null,"X","X","X","PF"]
[1149,"VIRGIN ATLANTIC","VS411","LOS",{"$f":"_xlfn.XLOOKUP(' Flight data base'!D1150,'airport codes'!$D$3:$D$2103,'airport codes'!$C$3:$C$2103)","v":"Nigeria"},"LHR",{"$f":"_xlfn.XLOOKUP(' Flight data base'!F1150,'airport codes'!$D$3:$D$2103,'airport codes'!$C$3:$C$2103)","v":"United Kingdom"},"2020-12-01","22h30","5h50","2020-12-31","X","X","X","X","X","X","X","PF"]
[1150,"VIRGIN ATLANTIC","VS187","ANU",{"$f":"_xlfn.XLOOKUP(' Flight data base'!D1151,'airport codes'!$D$3:$D$2103,'airport codes'!$C$3:$C$2103)","v":"Antigua and Barbuda"},"LHR",{"$f":"_xlfn.XLOOKUP(' Flight data base'!F1151,'airport codes'!$D$3:$D$2103,'airport codes'!$C$3:$C$2103)","v":"United Kingdom"},"2020-12-01","19H40","9H50","2020-12-31",null,null,"X",null,null,"X",null,"PF"]
[1151,"VIRGIN ATLANTIC","VS189","BGI",{"$f":"_xlfn.XLOOKUP(' Flight data base'!D1152,'airport codes'!$D$3:$D$2103,'airport codes'!$C$3:$C$2103)","v":"Barbados"},"LHR",{"$f":"_xlfn.XLOOKUP(' Flight data base'!F1152,'airport codes'!$D$3:$D$2103,'airport codes'!$C$3:$C$2103)","v":"United Kingdom"},"2020-12-01","23H35","9H30","2020-12-31","X",null,"X",null,null,"X",null,"PF"]
[1152,"VIRGIN ATLANTIC","VS189","GND",{"$f":"_xlfn.XLOOKUP(' Flight data base'!D1153,'airport codes'!$D$3:$D$2103,'airport codes'!$C$3:$C$2103)","v":"Grenada"},"LHR",{"$f":"_xlfn.XLOOKUP(' Flight data base'!F1153,'airport codes'!$D$3:$D$2103,'airport codes'!$C$3:$C$2103)","v":"United Kingdom"},"2020-12-01","19H15","9H30","2020-12-31","X",null,null,null,null,null,null,"PF"]
[1153,"VIRGIN ATLANTIC","VS479","CPT",{"$f":"_xlfn.XLOOKUP(' Flight data base'!D1154,'airport codes'!$D$3:$D$2103,'airport codes'!$C$3:$C$2103)","v":"South Africa"},"LHR",{"$f":"_xlfn.XLOOKUP(' Flight data base'!F1154,'airport codes'!$D$3:$D$2103,'airport codes'!$C$3:$C$2103)","v":"United Kingdom"},"2020-12-20","9H05","19H00","2020-12-31","X",null,"X",null,null,null,null,"PF"]
[1154,"VIRGIN ATLANTIC","VS078","BGI",{"$f":"_xlfn.XLOOKUP(' Flight data base'!D1155,'airport codes'!$D$3:$D$2103,'airport codes'!$C$3:$C$2103)","v":"Barbados"},"MAN",{"$f":"_xlfn.XLOOKUP(' Flight data base'!F1155,'airport codes'!$D$3:$D$2103,'airport codes'!$C$3:$C$2103)","v":"United Kingdom"},"2020-12-20","19H30","7H30","2020-12-31","X",null,null,null,null,"X",null,"PF"]
[1155,"VIRGIN ATLANTIC","VS450","JNB",{"$f":"_xlfn.XLOOKUP(' Flight data base'!D1156,'airport codes'!$D$3:$D$2103,'airport codes'!$C$3:$C$2103)","v":"South Africa"},"LHR",{"$f":"_xlfn.XLOOKUP(' Flight data base'!F1156,'airport codes'!$D$3:$D$2103,'airport codes'!$C$3:$C$2103)","v":"United Kingdom"},"2020-12-01","22h00","7h15","2020-12-31","X","X","X","X",null,"X","X","PF"]
[1156,"EGYPT AIR","MS520","CAI",{"$f":"_xlfn.XLOOKUP(' Flight data base'!D1157,'airport codes'!$D$3:$D$2103,'airport codes'!$C$3:$C$2103)","v":"Egypt"},"OST",{"$f":"_xlfn.XLOOKUP(' Flight data base'!F1157,'airport codes'!$D$3:$D$2103,'airport codes'!$C$3:$C$2103)","v":"Belgium"},"2020-10-01","09H30","13H50","2020-12-31",null,"X",null,"X",null,null,"X"]
[1157,"EGYPT AIR","MS536","CAI",{"$f":"_xlfn.XLOOKUP(' Flight data base'!D1158,'airport codes'!$D$3:$D$2103,'airport codes'!$C$3:$C$2103)","v":"Egypt"},"CGN",{"$f":"_xlfn.XLOOKUP(' Flight data base'!F1158,'airport codes'!$D$3:$D$2103,'airport codes'!$C$3:$C$2103)","v":"Germany"},"2020-10-01","10H30","14H30","2020-12-31",null,null,"X",null,"X",null,"X"]
[1158,"EGYPT AIR","MS532","CAI",{"$f":"_xlfn.XLOOKUP(' Flight data base'!D1159,'airport codes'!$D$3:$D$2103,'airport codes'!$C$3:$C$2103)","v":"Egypt"},"MXP",{"$f":"_xlfn.XLOOKUP(' Flight data base'!F1159,'airport codes'!$D$3:$D$2103,'airport codes'!$C$3:$C$2103)","v":"Italy"},"2020-10-01","9H30","13H30","2020-12-31",null,null,null,null,null,"X"]
[1159,"EGYPT AIR","MS549","NDJ",{"$f":"_xlfn.XLOOKUP(' Flight data base'!D1160,'airport codes'!$D$3:$D$2103,'airport codes'!$C$3:$C$2103)","v":"Chad"},"CAI",{"$f":"_xlfn.XLOOKUP(' Flight data base'!F1160,'airport codes'!$D$3:$D$2103,'airport codes'!$C$3:$C$2103)","v":"Egypt"},"2020-10-01","6H15","10H00","2020-12-31",null,null,"X"]
[1160,"EGYPT AIR","MS513","LOS",{"$f":"_xlfn.XLOOKUP(' Flight data base'!D1161,'airport codes'!$D$3:$D$2103,'airport codes'!$C$3:$C$2103)","v":"Nigeria"},"CAI",{"$f":"_xlfn.XLOOKUP(' Flight data base'!F1161,'airport codes'!$D$3:$D$2103,'airport codes'!$C$3:$C$2103)","v":"Egypt"},"2020-10-01","12H40","16H20","2020-12-31",null,null,null,"X"]
[1161,"EGYPT AIR","MS515","JNB",{"$f":"_xlfn.XLOOKUP(' Flight data base'!D1162,'airport codes'!$D$3:$D$2103,'airport codes'!$C$3:$C$2103)","v":"South Africa"},"CAI",{"$f":"_xlfn.XLOOKUP(' Flight data base'!F1162,'airport codes'!$D$3:$D$2103,'airport codes'!$C$3:$C$2103)","v":"Egypt"},"2020-10-01","17H35","01H30","2020-12-31",null,null,null,"X"]

{"sheet":"airport codes","index":2,"n_rows":2103,"n_cols":4,"rows_kept":2103,"cut":false,"hidden":false,"merged":[]}
[]
[null,"City/Airport","Country","IATA code"]
[null,"Aarhus","Denmark","AAR"]
[null,"Abadan","Iran","ABD"]
[null,"Abeche","Chad","AEH"]
[null,"Aberdeen","United Kingdom","ABZ"]
[null,"Aberdeen (SD)","USA","ABR"]
[null,"Abidjan","Cote d'Ivoire","ABJ"]
[null,"Abilene (TX)","USA","ABI"]
[null,"Abu Dhabi - Abu Dhabi International","United Arab Emirates","AUH"]
[null,"Abuja - Nnamdi Azikiwe International Airport","Nigeria","ABV"]
[null,"Abu Rudeis","Egypt","AUE"]
[null,"Abu Simbel","Egypt","ABS"]
[null,"Acapulco","Mexico","ACA"]
[null,"Accra - Kotoka International Airport","Ghana","ACC"]
[null,"Adana","Turkey","ADA"]
[null,"Addis Ababa - Bole International Airport","Ethiopia","ADD"]
[null,"Adelaide","Australia","ADL"]
[null,"Aden - Aden International Airport","Yemen","ADE"]
[null,"Adiyaman","Turkey","ADF"]
[null,"Adler/Sochi","Russia","AER"]
[null,"Agades","Niger","AJY"]
[null,"Agadir","Morocco","AGA"]
[null,"Agana (Hagåtña)","Guam","SUM"]
[null,"Aggeneys","South Africa","AGZ"]
[null,"Aguadilla","Puerto Rico","BQN"]
[null,"Aguascaliente","Mexico","AGU"]
[null,"Ahmedabad","India","AMD"]
[null,"Aiyura","Papua New Guinea","AYU"]
[null,"Ajaccio","France","AJA"]
[null,"Akita","Japan","AXT"]
[null,"Akron (OH)","USA","CAK"]
[null,"Akrotiri - RAF","Cyprus","AKT"]
[null,"Al Ain","United Arab Emirates","AAN"]
[null,"Al Arish","Egypt","AAC"]
[null,"Albany","Australia","ALH"]
[null,"Albany (GA)","USA","ABY"]
[null,"Albany (NY) - Albany International Airport","USA","ALB"]
[null,"Albi","France","LBI"]
[null,"Alborg","Denmark","AAL"]
[null,"Albuquerque (NM)","USA","ABQ"]
[null,"Albury","Australia","ABX"]
[null,"Alderney","Channel Islands","ACI"]
[null,"Aleppo","Syria","ALP"]
[null,"Alesund","Norway","AES"]
[null,"Alexander Bay - Kortdoorn","South Africa","ALJ"]
[null,"Alexandria - Borg el Arab Airport","Egypt","HBH"]
[null,"Alexandria - El Nhouza Airport","Egypt","ALY"]
[null,"Alexandria - Esler Field","USA (LA)","ESF"]
[null,"Alfujairah (Fujairah)","United Arab Emirates","FJR"]
[null,"Alghero Sassari","Italy","AHO"]
[null,"Algiers, Houari Boumediene Airport","Algeria","ALG"]
[null,"Al Hoceima","Morocco","AHU"]
[null,"Alicante","Spain","ALC"]
[null,"Alice Springs","Australia","ASP"]
[null,"Alldays","South Africa","ADY"]
[null,"Allentown (PA)","USA","ABE"]
[null,"Almaty (Alma Ata) - Almaty International Airport","Kazakhstan","ALA"]
[null,"Almeria","Spain","LEI"]
[null,"Alta","Norway","ALF"]
[null,"Altay","PR China","AAT"]
[null,"Altenrhein","Switzerland","ACH"]
[null,"Altoona (PA)","USA","AOO"]
[null,"Altus","USA","AXS"]
[null,"Amami","Japan","ASJ"]
[null,"Amarillo (TX)","USA","AMA"]
[null,"Amazon Bay","Papua New Guinea","AZB"]
[null,"Amman - Queen Alia International Airport","Jordan","AMM"]
[null,"Amman - Amman-Marka International Airport","Jordan","ADJ"]
[null,"Amritsar","India","ATQ"]
[null,"Amsterdam - Amsterdam Airport Schiphol","Netherlands","AMS"]
[null,"Anand","India","QNB"]
[null,"Anchorage (AK) - Ted Stevens Anchorage International","USA","ANC"]
[null,"Ancona - Ancona Falconara Airport","Italy","AOI"]
[null,"Andorra La Vella - Heliport","Andorra","ALV"]
[null,"Anguilla","Anguilla","AXA"]
[null,"Anjouan - Anjouan Airport","Comoros (Comores)","AJN"]
[null,"Ankara","Turkey","ANK"]
[null,"Ankara - Esenboğa International Airport","Turkey","ESB"]
[null,"Annaba","Algeria","AAE"]
[null,"Ann Arbor (MI)","USA","ARB"]
[null,"Annecy","France","NCY"]
[null,"Anniston (AL)","USA","ANB"]
[null,"Antalya","Turkey","AYT"]
[null,"Antananarivo (Tanannarive) - Ivato International Airport","Madagascar","TNR"]
[null,"Antigua, V.C. Bird International","Antigua and Barbuda","ANU"]
[null,"Antwerp","Belgium","ANR"]
[null,"Aomori","Japan","AOJ"]
[null,"Apia - Faleolo International Airport","Samoa","APW"]
[null,"Appelton/Neenah/Menasha (WI)","USA","ATW"]
[null,"Aqaba","Jordan","AQJ"]
[null,"Aracaju","Brazil","AJU"]
[null,"Arkhangelsk","Russia","ARH"]
[null,"Arusha","Tanzania","ARK"]
[null,"Araxos","Greece","GPA"]
[null,"Arlit","Niger","RLT"]
[null,"Arrecife/Lanzarote","Spain","ACE"]
[null,"Aruba - Reina Beatrix International, Oranjestad","Aruba","AUA"]
[null,"Asheville (NC)","USA","AVL"]
[null,"Ashgabat - Saparmurat Turkmenbashy Int. Airport","Turkmenistan","ASB"]
[null,"Asmara - Asmara International","Eritrea","ASM"]
[null,"Aspen, (CO) - Aspen-Pitkin County Airport","USA","ASE"]
[null,"Assiut","Egypt","ATZ"]
[null,"Astana - Astana International Airport","Kazakhstan","TSE"]
[null,"Asuncion - Asunción International Airport","Paraguay","ASU"]
[null,"Aswan - Daraw Airport","Egypt","ASW"]
[null,"Athens - Elefthérios Venizélos International Airport","Greece","ATH"]
[null,"Athens, Hellinikon Airport","Greece","HEW"]
[null,"Athens (GA)","USA","AHN"]
[null,"Athens (OH)","USA","ATO"]
[null,"Atlanta (GA) - Hartsfield Atlanta International Airport","USA","ATL"]
[null,"Atlantic City (NJ) - Atlantic City International","USA","ACY"]
[null,"Attawapiskat, NT","Canada","YAT"]
[null,"Auckland - Auckland International Airport","New Zealand","AKL"]
[null,"Augsburg - Augsbur gAirport","Germany","AGB"]
[null,"Augusta (GA)","USA","AGS"]
[null,"Augusta (ME) - Augusta State Airport","USA","AUG"]
[null,"Aurillac","France","AUR"]
[null,"Austin (TX) - Austin-Bergstrom Airport","USA","AUS"]
[null,"Ayawasi","Indonesia","AYW"]
[null,"Ayers Rock - Connellan","Australia","AYQ"]
[null,"Ayr","Australia","AYR"]
[]
[null,"B"]
[null,"Badajoz","Spain","BJZ"]
[null,"Bagdad - Baghdad International Airport","Iraq","BGW"]
[null,"Bagdogra","India","IXB"]
[null,"Bahamas - Lynden Pindling International Airport","The Bahamas","NAS"]
[null,"Bahawalpur","Pakistan","BHV"]
[null,"Bahrain - Bahrain International Airport","Bahrain","BAH"]
[null,"Bakersfield (CA)","USA","BFL"]
[null,"Baku - Heydar Aliyev International Airport","Azerbaijan","BAK"]
[null,"Ballina","Australia","BNK"]
[null,"Baltimore (MD) - Washington International Airport","USA","BWI"]
[null,"Bamaga","Australia","ABM"]
[null,"Bamako - Bamako-Sénou International Airport","Mali","BKO"]
[null,"Bambari","Central African Republic","BBY"]
[null,"Bandar Seri Begawan - Brunei International Airport","Brunei","BWN"]
[null,"Bandung - Husein Sastranegara International Airport","Indonesia","BDO"]
[null,"Bangalore","India","BLR"]
[null,"Bangassou","Central African Republic","BGU"]
[null,"Bangkok, Don Muang","Thailand","DMK"]
[null,"Bangkok, Suvarnabhumi International","Thailand","BKK"]
[null,"Bangor (ME)","USA","BGR"]
[null,"Bangui - M'Poko International Airport","Central African Republic","BGF"]
[null,"Banjul - Banjul International Airport (Yundum International)","Gambia","BJL"]
[null,"Bannu","Pakistan","BNP"]
[null,"Barcelona","Spain","BCN"]
[null,"Barcelona","Venezuela","BLA"]
[null,"Bardufoss","Norway","BDU"]
[null,"Bari","Italy","BRI"]
[null,"Barisal","Bangladesh","BZL"]
[null,"Baroda","India","BDQ"]
[null,"Barra (the famous tidal beach landing)","United Kingdom","BRR"]
[null,"Barranquilla","Colombia","BAQ"]
[null,"Basel","Switzerland","BSL"]
[null,"Basel/Mulhouse","Switzerland/France","EAP"]
[null,"Basra, Basrah","Iraq","BSR"]
[null,"Basse-Terre - Pointe-à-Pitre International Airport","Guadeloupe","PTP"]
[null,"Basseterre - Robert L. Bradshaw International Airport","Saint Kitts and Nevis","SKB"]
[null,"Bastia","France","BIA"]
[null,"Baton Rouge (LA) - Baton Rouge Metropolitan Airport","USA","BTR"]
[null,"Bayreuth - Bindlacher-Berg","Germany","BYU"]
[null,"Beaumont/Pt. Arthur (TX)","USA","BPT"]
[null,"Beckley (WV)","USA","BKW"]
[null,"Beef Island - Terrance B. Lettsome","Virgin Islands (British)","EIS"]
[null,"Beijing","China","PEK"]
[null,"Beijing - Nanyuan Airport","China","NAY"]
[null,"Beira","Mozambique","BEW"]
[null,"Beirut - Beirut Rafic Hariri International Airport","Lebanon","BEY"]
[null,"Belem - Val de Cans International Airport","Brazil","BEL"]
[null,"Belfast - George Best Belfast City Airport","United Kingdom","BHD"]
[null,"Belfast - Belfast International Airport","United Kingdom","BFS"]
[null,"Belgaum","India","IXG"]
[null,"Belgrad (Beograd) - Belgrade Nikola Tesla International","Serbia","BEG"]
[null,"Belize City - Philip S.W.Goldson International","Belize","BZE"]
[null,"Bellingham (WA)","USA","BLI"]
[null,"Belo Horizonte - Tancredo Neves International Airport","Brazil","CNF"]
[null,"Bemidji (MN)","USA","BJI"]
[null,"Benbecula","United Kingdom","BEB"]
[null,"Benghazi (Bengasi)","Libya","BEN"]
[null,"Benguela","Angola","BUG"]
[null,"Benton Harbour (MI)","USA","BEH"]
[null,"Berberati","Central African Republic","BBT"]
[null,"Bergamo/Milan - Orio Al Serio","Italy","BGY"]
[null,"Bergen","Norway","BGO"]
[null,"Bergerac - Roumanieres","France","EGC"]
[null,"Berlin","Germany","BER"]
[null,"Berlin, Schoenefeld","Germany","SXF"]
[null,"Berlin, Tegel","Germany","TXL"]
[null,"Berlin, Tempelhof (ceased operating in 2008)","Germany","THF"]
[null,"Bermuda - L.F. Wade International Airport","Bermuda","BDA"]
[null,"Berne, Bern-Belp","Switzerland","BRN"]
[null,"Berne, Railway Service","Switzerland","ZDJ"]
[null,"Bethel (AK)","USA","BET"]
[null,"Bhopal","India","BHO"]
[null,"Bhubaneswar","India","BBI"]
[null,"Biarritz","France","BIQ"]
[null,"Bilbao","Spain","BIO"]
[null,"Billings (MT)","USA","BIL"]
[null,"Billund","Denmark","BLL"]
[null,"Bintulu","Malaysia","BTU"]
[null,"Biraro","Central African Republic","IRO"]
[null,"Birmingham - Birmingham International Airport","United Kingdom","BHX"]
[null,"Birmingham (AL)","USA","BHM"]
[null,"Bishkek - Manas International Airport","Kyrgyzstan","FRU"]
[null,"Bismarck (ND) - Bismarck Municipal Airport","USA","BIS"]
[null,"Bissau - Osvaldo Vieiro International Airport","Guinea-Bissau","BXO"]
[null,"Blackpool","United Kingdom","BLK"]
[null,"Blackwater","Australia","BLT"]
[null,"Blantyre (Mandala) - Chileka International Airport","Malawi","BLZ"]
[null,"Blenheim","New Zealand","BHE"]
[null,"Bloemfontein - Bloemfontein Airport","South Africa","BFN"]
[null,"Bloomington (IL)","USA","BMI"]
[null,"Bloomington (IN)","USA","BMG"]
[null,"Bluefield (WV)","USA","BLF"]
[null,"Boa Vista","Brazil","BVB"]
[null,"Bobo/Dioulasso","Burkina Faso","BOY"]
[null,"Bodo","Norway","BOO"]
[null,"Bodrum - Milas Airport","Turkey","BJV"]
[null,"Bogota - El Nuevo Dorado International Airport","Colombia","BOG"]
[null,"Boise (ID) - Boise Air Terminal","USA","BOI"]
[null,"Bologna","Italy","BLQ"]
[null,"Bombay (Mumbai) - Chhatrapati Shivaji International","India","BOM"]
[null,"Bonaire","Netherlands Antilles","BON"]
[null,"Bonaventure, PQ","Canada","YVB"]
[null,"Bora Bora","French Polynesia","BOB"]
[null,"Bordeaux - Bordeaux Airport","France","BOD"]
[null,"Borrego Springs (CA)","USA","BXS"]
[null,"Boston (MA) - General Edward Lawrence Logan","USA","BOS"]
[null,"Bouake","Cote d'Ivoire","BYK"]
[null,"Bourgas/Burgas","Bulgaria","BOJ"]
[null,"Bournemouth","United Kingdom","BOH"]
[null,"Bosaso","Somalia","BSA"]
[null,"Bowen","Australia","ZBO"]
[null,"Bozeman (MT)","USA","BZN"]
[null,"Bradford/Warren (PA) /Olean (NY)","USA","BFD"]
[null,"Brainerd (MN)","USA","BRD"]
[null,"Brampton Island","Australia","BMP"]
[null,"Brasilia - President Juscelino Kubitschek International","Brazil","BSB"]
[null,"Bratislava - M. R. Štefánik Airport","Slovakia","BTS"]
[null,"Brazzaville - Maya-Maya Airport","Congo (ROC)","BZV"]
[null,"Bremen - Bremen Airport (Flughafen Bremen)","Germany","BRE"]
[null,"Brescia, Montichiari","Italy","VBS"]
[null,"Brest","France","BES"]
[null,"Bria","Central African Republic","BIV"]
[null,"Bridgeport (CT)","USA","BDR"]
[null,"Bridgetown - Grantley Adams International","Barbados","BGI"]
[null,"Brindisi","Italy","BDS"]
[null,"Brisbane","Australia","BNE"]
[null,"Bristol","United Kingdom","BRS"]
[null,"Broennoeysund","Norway","BNN"]
[null,"Broken Hill","Australia","BHQ"]
[null,"Brookings (SD)","USA","BKX"]
[null,"Broome","Australia","BME"]
[null,"Brunswick (GA)","USA","BQK"]
[null,"Brussels - Brussels Airport","Belgium","BRU"]
[null,"Bucaramanga","Colombia","BGA"]
[null,"Bucharest","Romania","BUH"]
[null,"Bucharest - Henri Coandă International Airport","Romania","OTP"]
[null,"Budapest - Budapest Ferihegy International Airport","Hungary","BUD"]
[null,"Buenos Aires","Argentina","BUE"]
[null,"Buenos Aires, Ezeiza International Airport","Argentina","EZE"]
[null,"Buenos Aires, Jorge Newbery","Argentina","AEP"]
[null,"Buffalo Range","Zimbabwe","BFO"]
[null,"Buffalo/Niagara Falls (NY)","USA","BUF"]
[null,"Bujumbura - Bujumbura International Airport","Burundi","BJM"]
[null,"Bulawayo","Zimbabwe","BUQ"]
[null,"Bullhead City (NV)","USA","BHC"]
[null,"Bundaberg","Australia","BDB"]
[null,"Burbank (CA)","USA","BUR"]
[null,"Burlington IA","USA","BRL"]
[null,"Burlington (VT)","USA","BTV"]
[null,"Burnie (Wynyard)","Australia","BWT"]
[null,"Butte (MT)","USA","BTM"]
[]
[]
[null,"Every once in a while go somewhere you have never been before."]
[null,"Anonymus"]
[]
[]
[]
[null,"Cabinda","Angola","CAB"]
[null,"Cagliari","Italy","CAG"]
[null,"Cairns","Australia","CNS"]
[null,"Cairo - Cairo International Airport","Egypt","CAI"]
[null,"Calama - El Loa","Chile","CJC"]
[null,"Calcutta (Kolkata) - Netaji Subhas Chandra","India","CCU"]
[null,"Calgary - Calgary International Airport","Canada","YYC"]
[null,"Cali","Colombia","CLO"]
[null,"Calicut","India","CCJ"]
[null,"Calvi","France","CLY"]
[null,"Cambridge Bay","Canada","YCB"]
[null,"Cambrigde","United Kingdom","CBG"]
[null,"Campbeltown","United Kingdom","CAL"]
[null,"Campo Grande","Brazil","CGR"]
[null,"Canberra - Canberra Airport","Australia","CBR"]
[null,"Cancun","Mexico","CUN"]
[null,"Cannes – Mandelieu Airport","France","CEQ"]
[null,"Canouan (island) - Canouan Airport","Saint Vincent & the Grenadines","CIW"]
[null,"Cape Town - Cape Town International Airport","South Africa","CPT"]
[null,"Caracas - Simón Bolívar International Airport","Venezuela","CCS"]
[null,"Cardiff - Cardiff Airport","United Kingdom","CWL"]
[null,"Carlsbad (CA)","USA","CLD"]
[null,"Carnarvon","Australia","CVQ"]
[null,"Carnot","Central African Republic","CRF"]
[null,"Carson City (NV)","USA","CSN"]
[null,"Casablanca","Morocco","CAS"]
[null,"Casablanca, Mohamed V","Morocco","CMN"]
[null,"Casa de Campo - La Romana International Airport","Dominican Republic","LRM"]
[null,"Casino","Australia","CSI"]
[null,"Casper (WY)","USA","CPR"]
[null,"Castaway","Fiji","CST"]
[null,"Cartagena - Rafael Núñez International Airport","Colombia","CTG"]
[null,"Castries - George F. L. Charles Airport","Saint Lucia","SLU"]
[null,"Catania","Italy","CTA"]
[null,"Cayenne - Cayenne-Rochambeau Airport","French Guiana","CAY"]
[null,"Cottbus - Cottbus-Drewitz Airport","Germany","CBU"]
[null,"Cebu City - Mactan-Cebu International","Philippines","CEB"]
[null,"Cedar City (UT)","USA","CDC"]
[null,"Cedar Rapids IA","USA","CID"]
[null,"Ceduna","Australia","CED"]
[null,"Cessnock","Australia","CES"]
[null,"Chabarovsk (Khabarovsk)","Russia","KHV"]
[null,"Chambery","France","CMF"]
[null,"Champaign (IL)","USA","CMI"]
[null,"Chandigarh - Chandigarh International Airport","India","IXC"]
[null,"Changchun","Jilin, PR China","CGQ"]
[null,"Chania","Greece","CHQ"]
[null,"Chaoyang, Beijing - Chaoyang Airport","PR China","CHG"]
[null,"Charleston (SC)","USA","CHS"]
[null,"Charleston (WV) - Yeager Airport","USA","CRW"]
[null,"Charlotte (NC)","USA","CLT"]
[null,"Charlottesville (VA)","USA","CHO"]
[null,"Charters Towers","Australia","CXT"]
[null,"Chattanooga (TN)","USA","CHA"]
[null,"Chengdu - Shuangliu","Sichuan, PR China","CTU"]
[null,"Chennai (Madras)","India","MAA"]
[null,"Cheyenne (WY) - Cheyenne Regional Airport","USA","CYS"]
[null,"Chiang Mai - Chiang Mai International Airport","Thailand","CNX"]
[null,"Chiba City","Japan","QCB"]
[null,"Chicago (IL), Midway","USA","MDW"]
[null,"Chicago (IL), O'Hare International Airport","USA","ORD"]
[null,"Chicago (IL)","USA","CHI"]
[null,"Chichen Itza","Mexico","CZA"]
[null,"Chico (CA)","USA","CIC"]
[null,"Chihuahua - Gen Fierro Villalobos","Mexico","CUU"]
[null,"Chios","Greece","JKH"]
[null,"Chipata","Zambia","CIP"]
[null,"Chisinau - Chişinău International Airport","Moldova","KIV"]
[null,"Chita (Tschita)","Russia","HTA"]
[null,"Sapporo - New Chitose Airport","Japan","CTS"]
[null,"Chitral","Pakistan","CJL"]
[null,"Chittagong","Bangladesh","CGP"]
[null,"Chongqing - Jiangbei International Airport","Sichuan, PR China","CKG"]
[null,"Christchurch","New Zealand","CHC"]
[null,"Chub Cay","Bahamas","CCZ"]
[null,"Churchill","Canada","YYQ"]
[null,"Cienfuegos - Jaime González Airport","Cuba","CFG"]
[null,"Cincinnati (OH) - Cincinnati/Northern Kentucky Int'l","USA","CVG"]
[null,"Ciudad Del Carmen","Mexico","CME"]
[null,"Ciudad Guayana","Venezuela","CGU"]
[null,"Ciudad Juarez","Mexico","CJS"]
[null,"Ciudad Obregon","Mexico","CEN"]
[null,"Ciudad Victoria","Mexico","CVM"]
[null,"Clarksburg (WV)","USA","CKB"]
[null,"Clermont","Australia","CMQ"]
[null,"Clermont Ferrand","France","CFE"]
[null,"Cleveland (OH) , Burke Lakefront","USA","BKL"]
[null,"Cleveland (OH) - Cleveland Hopkins International","USA","CLE"]
[null,"Cochabamba","Bolivia","CBB"]
[null,"Cochin","India","COK"]
[null,"Cody/Powell/Yellowstone (WY)","USA","COD"]
[null,"Coffmann Cove (AK)","USA","KCC"]
[null,"Coffs Harbour","Australia","CFS"]
[null,"Coimbatore","India","CJB"]
[null,"Colima","Mexico","CLQ"]
[null,"College Station/Bryan (TX)","USA","CLL"]
[null,"Collinsville","Australia","KCE"]
[null,"Cologne - Cologne Airport (Flughafen Köln/Bonn)","Germany","CGN"]
[null,"Colombo - Bandaranaike International Airport","Sri Lanka","CMB"]
[null,"Colorado Springs (CO)","USA","COS"]
[null,"Columbia (SC) - Columbia Metropolitan Airport","USA","CAE"]
[null,"Columbus (GA)","USA","CSG"]
[null,"Columbus (OH) - Port Columbus International","USA","CMH"]
[null,"Conakry - Conakry International Airport","Guinea","CKY"]
[null,"Concord (CA) - Buchanan Field","USA","CCR"]
[null,"Concord (NH) - Concord Municipal Airport","USA","CON"]
[null,"Constantine","Algeria","CZL"]
[null,"Constanta (Constanța) - Constanta Int'l Airport","Romania","CND"]
[null,"Coober Pedy","Australia","CPD"]
[null,"Cooktown","Australia","CTN"]
[null,"Cooma","Australia","OOM"]
[null,"Copenhagen - Copenhagen Airport","Denmark","CPH"]
[null,"Cordoba","Argentina","COR"]
[null,"Cordoba","Spain","ODB"]
[null,"Cordova (AK)","USA","CDV"]
[null,"Corfu","Greece","CFU"]
[null,"Cork","Ireland","ORK"]
[null,"Corpus Christi (TX)","USA","CRP"]
[null,"Cotonou - Cotonou Cadjehoun Airport","Benin","COO"]
[null,"Coventry - Baginton","United Kingdom","CVT"]
[null,"Cozmel","Mexico","CZM"]
[null,"Craig (AK)","USA","CGA"]
[null,"Crescent City (CA)","USA","CEC"]
[null,"Cuiaba - Marechal Rondon International Airport","Brazil","CGB"]
[null,"Culiacan","Mexico","CUL"]
[null,"Curacao - Curaçao International Airport","Netherlands Antilles","CUR"]
[null,"Curitiba - Afonso Pena International Airport","Brazil","CWB"]
[null,"Cuyo","Philippines","CYU"]
[]
[null,"D"]
[null,"Dakar - Léopold Sédar Senghor International Airport","Senegal","DKR"]
[null,"Dakar Blaise Diagne","Senegal","DSS"]
[null,"Dalaman","Turkey","DLM"]
[null,"Dalby","Australia","DBY"]
[null,"Dalian - Zhoushuizi International Airport","Liaoning, PR China","DLC"]
[null,"Dallas (TX) , Love Field","USA","DAL"]
[null,"Dallas/Ft. Worth (TX) - Dallas/Fort Worth International","USA","DFW"]
[null,"Daloa","Cote d'Ivoire","DJO"]
[null,"Damascus, International","Syria","DAM"]
[null,"Dammam, King Fahad International","Saudi Arabien","DMM"]
[null,"Danville (VA)","USA","DAN"]
[null,"Dar es Salam (Daressalam) - Julius Nyerere Int'l","Tanzania","DAR"]
[null,"Darwin","Australia","DRW"]
[null,"Daydream Island","Australia","DDI"]
[null,"Dayton (OH)","USA","DAY"]
[null,"Daytona Beach (FL)","USA","DAB"]
[null,"Decatur (IL)","USA","DEC"]
[null,"Deer Lake/Corner Brook","Canada","YDF"]
[null,"Delhi - Indira Gandhi International Airport","India","DEL"]
[null,"Den Haag (The Hague)","Netherlands","HAG"]
[null,"Denizli","Turkey","DNZ"]
[null,"Denpasar/Bali","Indonesia","DPS"]
[null,"Denver (CO) - Denver International Airport","USA","DEN"]
[null,"Dera Ismail Khan - Dera Ismail Khan Airport","Pakistan","DSK"]
[null,"Derby","Australia","DRB"]
[null,"Derry (Londonderry)","United Kingdom","LDY"]
[null,"Des Moines (IA) - Des Moines International Airport","USA","DSM"]
[null,"Detroit (MI) , Coleman A. Young Municipal","USA","DET"]
[null,"Detroit (MI) , Wayne County Airport","USA","DTW"]
[null,"Detroit (MI) , Metropolitan Area","USA","DTT"]
[null,"Devils Lake (ND)","USA","DVL"]
[null,"Devonport","Australia","DPO"]
[null,"Dhahran","Saudi Arabia","DHA"]
[null,"Dhaka - Zia International Airport","Bangladesh","DAC"]
[null,"Dili - Nicolau Lobato International Airport","Timor Leste (East Timor)","DIL"]
[null,"Dillingham (AK)","USA","DLG"]
[null,"Dinard","France","DNR"]
[null,"Disneyland Paris","France","DLP"]
[null,"Djerba","Tunisia","DJE"]
[null,"Djibouti (city) - Djibouti-Ambouli International Airport","Djibouti","JIB"]
[null,"Dodoma - Dodoma Airport","Tanzania","DOD"]
[null,"Doha - Doha International Airport","Qatar","DOH"]
[null,"Doncaster/Sheffield, Robin Hood International Airport","United Kingdom","DSA"]
[null,"Donegal (Carrickfin)","Ireland","CFN"]
[null,"Dortmund","Germany","DTM"]
[null,"Dothan (AL)","USA","DHN"]
[null,"Douala","Cameroon","DLA"]
[null,"Dresden - Dresden Airport","Germany","DRS"]
[null,"Dubai - Dubai International Airport","United Arab Emirates","DXB"]
[null,"Dubbo","Australia","DBO"]
[null,"Dublin - Dublin International Airport","Ireland","DUB"]
[null,"Dubois (PA)","USA","DUJ"]
[null,"Dubrovnik","Croatia (Hrvatska)","DBV"]
[null,"Dubuque IA","USA","DBQ"]
[null,"Duesseldorf - Düsseldorf International Airport","Germany","DUS"]
[null,"Duluth (MN) /Superior (WI)","USA","DLH"]
[null,"Dundee","United Kingdom","DND"]
[null,"Dunedin","New Zealand","DUD"]
[null,"Dunk Island","Australia","DKI"]
[null,"Durango (CO)","USA","DRO"]
[null,"Durban","South Africa","DUR"]
[null,"Dushanbe (Duschanbe) - Dushanbe Airport","Tajikistan","DYU"]
[null,"Dutch Harbor (AK)","USA","DUT"]
[null,"Dysart","Australia","DYA"]
[null,"Dzaoudzi","Mayotte","DZA"]
[]
[]
[null,"Excuse me while I kiss the sky."]
[null,"Jimi Hendrix (Purple Haze)"]
[]
[]
[]
[null,"E"]
[null,"East London","South Africa","ELS"]
[null,"Easter Island","Chile","IPC"]
[null,"Eau Clarie (WI)","USA","EAU"]
[null,"Edinburgh - Edinburgh Airport","Scotland, UK","EDI"]
[null,"Edmonton","Canada","YEA"]
[null,"Edmonton, International","Canada","YEG"]
[null,"Edmonton, Municipal","Canada","YXD"]
[null,"Egilsstadir","Iceland","EGS"]
[null,"Eindhoven","Netherlands","EIN"]
[null,"Samana - Samaná El Catey International Airport","Dominican Republic","AZS"]
[null,"Elba Island, Marina Di Campo","Italy","EBA"]
[null,"Elat","Israel","ETH"]
[null,"Elat, Ovula","Israel","VDA"]
[null,"Elkhart (IN)","USA","EKI"]
[null,"Elko (NV)","USA","EKO"]
[null,"Ellisras","South Africa","ELL"]
[null,"El Minya","Egypt","EMY"]
[null,"Elmira (NY)","USA","ELM"]
[null,"El Paso (TX) - El Paso International Airport","USA","ELP"]
[null,"Ely (NV)","USA","ELY"]
[null,"Emerald","Australia","EDR"]
[null,"Emerald","Australia","EMD"]
[null,"Enontekioe","Finland","ENF"]
[null,"Entebbe - Entebbe International Airport","Uganda","EBB"]
[null,"Erfurt - Erfurt Airport (Flughafen Erfurt)","Germany","ERF"]
[null,"Erie (PA)","USA","ERI"]
[null,"Eriwan (Yerevan, Jerevan)","Armenia","EVN"]
[null,"Erzincan","Turkey","ERC"]
[null,"Erzurum","Turkey","ERZ"]
[null,"Esbjerg","Denmark","EBJ"]
[null,"Escanaba (MI)","USA","ESC"]
[null,"Esperance","Australia","EPR"]
[null,"Eugene (OR)","USA","EUG"]
[null,"Eureka (CA)","USA","ACV"]
[null,"Evansville (IN)","USA","EVV"]
[null,"Evenes","Norway","EVE"]
[null,"Exeter","United Kingdom","EXT"]
[]
[null,"F"]
[null,"Fairbanks (AK)","USA","FAI"]
[null,"Fair Isle (Shetland)","United Kingdom","FIE"]
[null,"Faisalabad","Pakistan","LYP"]
[null,"Fargo (ND) (MN)","USA","FAR"]
[null,"Farmington (NM)","USA","FMN"]
[null,"Faro","Portugal","FAO"]
[null,"Faroer - Vágar Airport","Denmark","FAE"]
[null,"Fayetteville (AR)","USA","FYV"]
[null,"Fayetteville/Ft. Bragg (NC)","USA","FAY"]
[null,"Fes","Morocco","FEZ"]
[null,"Figari","France","FSC"]
[null,"Flagstaff (AZ)","USA","FLG"]
[null,"Flin Flon","Canada","YFO"]
[null,"Flint (MI)","USA","FNT"]
[null,"Florence (Firenze) - Peretola Airport","Italy","FLR"]
[null,"Florence (SC)","USA","FLO"]
[null,"Florianopolis","Brazil","FLN"]
[null,"Floro","Norway","FRO"]
[null,"Fort Albert","Canada","YFA"]
[null,"Fortaleza - Pinto Martins Airport","Brazil","FOR"]
[null,"Fort de France - Martinique Aimé Césaire International","Martinique","FDF"]
[null,"Fort Dodge IA","USA","FOD"]
[null,"Fort Huachuca/Sierra Vista (AZ)","USA","FHU"]
[null,"Fort Lauderdale/Hollywood (FL)","USA","FLL"]
[null,"Fort McMurray","Canada","YMM"]
[null,"Fort Myers, Metropolitan Area (FL)","USA","FMY"]
[null,"Fort Myers, Southwest Florida Reg (FL)","USA","RSW"]
[null,"Fort Riley (KS) - Marshall AAF","USA","FRI"]
[null,"Fort Smith","Canada","YSM"]
[null,"Fort Smith (AR)","USA","FSM"]
[null,"Fort St. John","Canada","YXJ"]
[null,"Fort Walton Beach (FL)","USA","VPS"]
[null,"Fort Wayne (IN)","USA","FWA"]
[null,"Fort Worth (TX) - Dallas/Fort Worth International Airport","USA","DFW"]
[null,"Foula (Shetland)","United Kingdom","FOU"]
[null,"Francistown","Botswana","FRW"]
[null,"Frankfurt/Main - Frankfurt Airport (Rhein-Main-Flughafen)","Germany","FRA"]
[null,"Frankfurt/Hahn","Germany","HHN"]
[null,"Franklin/Oil City (PA)","USA","FKL"]
[null,"Fredericton","Canada","YFC"]
[null,"Freeport - Grand Bahama International Airport","Bahamas","FPO"]
[null,"Freetown - Freetown-Lungi International Airport","Sierra Leone","FNA"]
[null,"Frejus","France","FRJ"]
[null,"Fresno (CA)","USA","FAT"]
[null,"Friedrichshafen - Bodensee-Airport Friedrichshafen","Germany","FDH"]
[null,"Fuerteventura","Spain","FUE"]
[null,"Fujairah, International Airport","United Arab Emirates","FJR"]
[null,"Fukuoka","Japan","FUK"]
[null,"Fukushima - Fukushima Airport","Japan","FKS"]
[null,"Funchal","Portugal","FNC"]
[null,"Futuna","Wallis and Futuna Islands","FUT"]
[]
[]
[null,"If you think adventure is dangerous, try routine; it is lethal."]
[null,"Paulo Coelho"]
[]
[]
[]
[null,"G"]
[null,"Gaborone - Sir Seretse Khama International Airport","Botswana","GBE"]
[null,"Gadsden (AL)","USA","GAD"]
[null,"Gainesville (FL)","USA","GNV"]
[null,"Galway","Ireland","GWY"]
[null,"Gander","Canada","YQX"]
[null,"Garoua","Cameroon","GOU"]
[null,"Gaza City - Gaza International Airport","Palestinian Territory","GZA"]
[null,"Gaziantep","Turkey","GZT"]
[null,"Gdansk","Poland","GDN"]
[null,"Geelong","Australia","GEX"]
[null,"Geneva - Geneva-Cointrin International Airport","Switzerland","GVA"]
[null,"Genoa","Italy","GOA"]
[null,"George","South Africa","GRJ"]
[null,"Georgetown - Cheddi Jagan International Airport","Guyana","GEO"]
[null,"Geraldton","Australia","GET"]
[null,"Gerona","Spain","GRO"]
[null,"Ghent (Gent)","Belgium","GNE"]
[null,"Gibraltar","Gibraltar","GIB"]
[null,"Gilette (WY)","USA","GCC"]
[null,"Gilgit","Pakistan","GIL"]
[null,"Gillam","Canada","YGX"]
[null,"Gladstone","Australia","GLT"]
[null,"Glasgow, Prestwick","United Kingdom","PIK"]
[null,"Glasgow","United Kingdom","GLA"]
[null,"Glasgow (MT)","USA","GGW"]
[null,"Glendive (MT)","USA","GDV"]
[null,"Goa","India","GOI"]
[null,"Goiania, Santa Genoveva Airport","Brazil","GYN"]
[null,"Gold Coast","Australia","OOL"]
[null,"Goondiwindi","Australia","GOO"]
[null,"Goose Bay","Canada","YYR"]
[null,"Gorna","Bulgaria","GOZ"]
[null,"Gothenburg (Göteborg) - Landvetter","Sweden","GOT"]
[null,"Gove (Nhulunbuy)","Australia","GOV"]
[null,"Govenors Harbour","Bahamas","GHB"]
[null,"Granada","Spain","GRX"]
[null,"Grand Bahama International","Bahamas","FPO"]
[null,"Grand Canyon (AZ)","USA","GCN"]
[null,"Grand Cayman - Owen Roberts International","Cayman Islands","GCM"]
[null,"Grand Forks (ND)","USA","GFK"]
[null,"Grand Junction (CO)","USA","GJT"]
[null,"Grand Rapids (MI)","USA","GRR"]
[null,"Grand Rapids (MN)","USA","GPZ"]
[null,"Graz","Austria","GRZ"]
[null,"Great Falls (MT)","USA","GTF"]
[null,"Great Keppel Island","Australia","GKL"]
[null,"Green Bay (WI)","USA","GRB"]
[null,"Greenbrier/Lewisburg (WV)","USA","LWB"]
[null,"Greensboro/Winston Salem (NC)","USA","GSO"]
[null,"Greenville (MS)","USA","GLH"]
[null,"Greenville (NC)","USA","PGV"]
[null,"Greenville/Spartanburg (SC)","USA","GSP"]
[null,"Grenada - Point Salines Airport also Maurice Bishop","Grenada","GND"]
[null,"Grenoble","France","GNB"]
[null,"Griffith","Australia","GFF"]
[null,"Groningen - Eelde","Netherlands","GRQ"]
[null,"Groote Eylandt - Alyangula","Australia","GTE"]
[null,"Groton/New London (CT)","USA","GON"]
[null,"Guadalajara","Mexico","GDL"]
[null,"Guadalcanal","Solomon Islands","GSI"]
[null,"Guam","Guam","GUM"]
[null,"Guangzhou (Canton) - Baiyun International Airport","Guangdong, PR China","CAN"]
[null,"Sao Paulo - Guarulhos International","Brazil","GRU"]
[null,"Guatemala City - La Aurora International Airport","Guatemala","GUA"]
[null,"Guayaquil - Simon Bolivar","Ecuador","GYE"]
[null,"Guernsey","Channel Islands","GCI"]
[null,"Guettin","Germany","GTI"]
[null,"Gulfport/Biloxi (MS)","USA","GPT"]
[null,"Guilin - Liangjiang","Guangxi, PR China","KWL"]
[null,"Gulu","Uganda","ULU"]
[null,"Gunnison/Crested Butte (CO)","USA","GUC"]
[null,"Guwahati","India","GAU"]
[null,"Gwadar","Pakistan","GWD"]
[null,"Gweru","Zimbabwe","GWE"]
[null,"Gympie","Australia","GYP"]
[]
[null,"H"]
[null,"Hachijo Jima","Japan","HAC"]
[null,"Hagåtña - Guam International Airport","Guam","GUM"]
[null,"Haifa","Israel","HFA"]
[null,"Haines (AK)","USA","HNS"]
[null,"Hakodate","Japan","HKD"]
[null,"Halifax International","Canada","YHZ"]
[null,"Hall Beach","Canada","YUX"]
[null,"Hamburg - Fuhlsbuettel","Germany","HAM"]
[null,"Hamilton","Australia","HLT"]
[null,"Hamilton","Canada","YHM"]
[null,"Hamilton","New Zealand","HLZ"]
[null,"Hamilton Island","Australia","HTI"]
[null,"Hammerfest","Norway","HFT"]
[null,"Hancock (MI)","USA","CMX"]
[null,"Hangchow (Hangzhou)","Zhejiang, PR China","HGH"]
[null,"Hannover","Germany","HAJ"]
[null,"Hanoi - Noi Bai International Airport","Vietnam","HAN"]
[null,"Harare - Harare International Airport","Zimbabwe","HRE"]
[null,"Harbin (Haerbin)","Heilongjiang, PR China","HRB"]
[null,"Hargeisa","Somalia","HGA"]
[null,"Harlingen/South Padre Island (TX)","USA","HRL"]
[null,"Harrington Harbour, PQ","Canada","YHR"]
[null,"Harrisburg (PA) - Harrisburg Skyport","USA","HAR"]
[null,"Harrisburg (PA) - Harrisburg International","USA","MDT"]
[null,"Hartford (CT) /Springfield (MA)","USA","BDL"]
[null,"Hatyai (Hat Yai)","Thailand","HDY"]
[null,"Haugesund","Norway","HAU"]
[null,"Havana - José Martí International","Cuba","HAV"]
[null,"Havre (MT)","USA","HVR"]
[null,"Hayman Island","Australia","HIS"]
[null,"Helena (MT)","USA","HLN"]
[null,"Helsingborg","Sweden","JHE"]
[null,"Helsinki - Vantaa","Finland","HEL"]
[null,"Heraklion","Greece","HER"]
[null,"Hermosillo - Gen. Pesqueira Garcia","Mexico","HMO"]
[null,"Hervey Bay","Australia","HVB"]
[null,"Hibbing (MN)","USA","HIB"]
[null,"Hickory (NC)","USA","HKY"]
[null,"Hilo (HI)","USA","ITO"]
[null,"Hilton Head Island (SC)","USA","HHH"]
[null,"Hinchinbrook Island","Australia","HNK"]
[null,"Hiroshima International","Japan","HIJ"]
[null,"Ho Chi Minh City (Saigon) - Tan Son Nhat International","Viet Nam","SGN"]
[null,"Hobart","Australia","HBA"]
[null,"Hof","Germany","HOQ"]
[null,"Holguin","Cuba","HOG"]
[null,"Home Hill","Australia","HMH"]
[null,"Homer (AK)","USA","HOM"]
[null,"Hong Kong - International Airport (HKIA)","Hong Kong","HKG"]
[null,"Hong Kong - Chek Lap Kok","Hong Kong","ZJK"]
[null,"Honiara Henderson International","Solomon Islands","HIR"]
[null,"Honolulu (HI) - Honolulu International Airport","USA","HNL"]
[null,"Hoonah (AK)","USA","HNH"]
[null,"Horta","Portugal","HOR"]
[null,"Houston (TX) , Hobby","USA","HOU"]
[null,"Houston, TX - George Bush Intercontinental Airport","USA","IAH"]
[null,"Huahine","French Polynesia","HUH"]
[null,"Huatulco","Mexico","HUX"]
[null,"Hue - Phu Bai","Viet Nam","HUI"]
[null,"Humberside","United Kingdom","HUY"]
[null,"Huntington (WV)","USA","HTS"]
[null,"Huntsville (AL)","USA","HSV"]
[null,"Hurghada International","Egypt","HRG"]
[null,"Huron (SD)","USA","HON"]
[null,"Hwange National Park","Zimbabwe","HWN"]
[null,"Hyannis (MA)","USA","HYA"]
[null,"Hydaburg (AK)","USA","HYG"]
[null,"Hyderabad - Rajiv Gandhi International Airport","India","HYD"]
[null,"Hyderabad","Pakistan","HDD"]
[]
[null,"I"]
[null,"Ibiza","Ibiza/Spain","IBZ"]
[null,"Idaho Falls (ID)","USA","IDA"]
[null,"Iguazu, Cataratas","Argentina","IGR"]
[null,"Ile des Pins","New Caledonia","ILP"]
[null,"Ile Ouen","New Caledonia","IOU"]
[null,"Iliamna (AK)","USA","ILI"]
[null,"Imperial (CA)","USA","IPL"]
[null,"Incercargill","New Zealand","IVC"]
[null,"Incheon, Incheon International Airport","Korea South","ICN"]
[null,"Indianapolis (IN) International","USA","IND"]
[null,"Ingham","Australia","IGH"]
[null,"Innisfail","Australia","IFL"]
[null,"Innsbruck - Kranebitten","Austria","INN"]
[null,"International Falls (MN)","USA","INL"]
[null,"Inuvik","Canada","YEV"]
[null,"Invercargill","New Zealand","IVC"]
[null,"Inverness","United Kingdom","INV"]
[null,"Inykern (CA)","USA","IYK"]
[null,"Iqaluit (Frobisher Bay)","Canada","YFB"]
[null,"Iquitos","Peru","IQT"]
[null,"Irkutsk","Russia","IKT"]
[null,"Ishigaki - New Ishigaki Airport","Japan","ISG"]
[null,"Islamabad - Benazir Bhutto International Airport","Pakistan","ISB"]
[null,"Islay","United Kingdom","ILY"]
[null,"Isle of Man",null,"IOM"]
[null,"Istanbul - Istanbul Atatürk Airport","Turkey","IST"]
[null,"Istanbul - Sabiha Gokcen","Turkey","SAW"]
[null,"Ithaca/Cortland (NY)","USA","ITH"]
[null,"Ivalo","Finland","IVL"]
[null,"Ixtapa/Zihuatenejo","Mexico","ZIH"]
[null,"Izmir","Turkey","IZM"]
[null,"Izmir - Adnan Menderes Airport","Turkey","ADB"]
[]
[]
[null,"Travel makes one modest. You see what a tiny place you occupy in the world."]
[null,"Gustave Flaubert"]
[]
[]
[]
[null,"J"]
[null,"Jackson Hole (WY)","USA","JAC"]
[null,"Jackson (MI) - Reynolds Municipal","USA","JXN"]
[null,"Jackson,  MN  ","USA","MJQ"]
[null,"Jackson (MS) - Jackson Internationall","USA","JAN"]
[null,"Jackson (MS) - Hawkins Field   ","USA","HKS"]
[null,"Jackson (TN) - Mckellar","USA","MKL"]
[null,"Jackson Hole (WY)","USA","JAC"]
[null,"Jacksonville (AR)  Little Rock AFB   ","USA","LRF"]
[null,"Jacksonville (FL) - Cecil Field NAS   ","USA","NZC"]
[null,"Jacksonville (FL) Jacksonville NAS   ","USA","NIP"]
[null,"Jacksonville (FL) - International","USA","JAX"]
[null,"Jacksonville (FL) - Craig Municipal   ","USA","CRG"]
[null,"Jacksonville (IL) - Municipal Airport","USA","IJX"]
[null,"Jacksonville (NC)","USA","OAJ"]
[null,"Jacksonville (TX)","USA","JKV"]
[null,"Jacmel   ","Haiti","JAK"]
[null,"Jacobabad","Pakistan","JAG"]
[null,"Jacobina   ","Brazil","JCM"]
[null,"Jacquinot Bay","Papua New Guinea","JAQ"]
[null,"Jaffna - Kankesanturai","Sri Lanka","JAF"]
[null,"Jagdalpur","India","JGB"]
[null,"Jaipur - Sanganeer","India","JAI"]
[null,"Jaisalmer   ","India","JSA"]
[null,"Jakarta - Halim Perdana Kusuma","Indonesia","HLP"]
[null,"Jakarta - Metropolitan Area","Indonesia","JKT"]
[null,"Jakarta - Soekarno-Hatta International","Indonesia","CGK"]
[null,"Jalalabad    ","Afghanistan","JAA"]
[null,"Jalandhar","India","JLR"]
[null,"Jalapa","Mexico","JAL"]
[null,"Jales","Brazil","JLS"]
[null,"Jaluit Island  ","Marshall Islands","UIT"]
[null,"Jamba","Angola","JMB"]
[null,"Jambi - Sultan Taha Syarifudn","Indonesia ","DJB"]
[null,"Jambol","Bulgaria","JAM"]
[null,"Jamestown (ND)","USA","JMS"]
[null,"Jamestown (NY)","USA","JHW"]
[null,"Jammu - Satwari","India","IXJ"]
[null,"Jamnagar - Govardhanpur","India","JGA"]
[null,"Jamshedpur - Sonari Airport","India","IXW"]
[null,"Janakpur","Nepal","JKR"]
[null,"Jandakot","Australia","JAD"]
[null,"Janesville (WI) - Rock County","USA","JVL"]
[null,"Januaria","Brazil","JNA"]
[null,"Jaque   ","Panama","JQE"]
[null,"Jatai","Brazil","JTI"]
[null,"Jauja","Peru","JAU"]
[null,"Jayapura - Sentani","Indonesia","DJJ"]
[null,"Jeddah - King Abdulaziz International","Saudi Arabia","JED"]
[null,"Jefferson City (MO) - Jefferson Memorial","USA","JEF"]
[null,"Jeremie - Jeremie Airport","Haiti","JEE"]
[null,"Jerez de la Frontera/Cadiz - La Parra","Spain","XRY"]
[null,"Jersey","Channel Islands","JER"]
[null,"Jerusalem - Atarot Airport (closed)","Israel","JRS"]
[null,"Jessore - Jessore Airport","Bangladesh","JSR"]
[null,"Jeypore - Jeypore Airport","India","PYB"]
[null,"Ji'an","Jiangxi, China","JGS"]
[null,"Jiamusi - Jiamusi Airport","PR China","JMU"]
[null,"Jiayuguan - Jiayuguan Airport","PR China","JGN"]
[null,"Jijel","Algeria","GJL"]
[null,"Jijiga","Ethiopia","JIJ"]
[null,"Jilin","PR China","JIL"]
[null,"Jimma","Ethiopia","JIM"]
[null,"Jinan","Shandong, PR China","TNA"]
[null,"Jingdezhen","PR China","JDZ"]
[null,"Jinghong - Gasa Airport","PR China","JHG"]
[null,"Jining","PR China","JNG"]
[null,"Jinja","Uganda","JIN"]
[null,"Jinjiang","PR China","JJN"]
[null,"Jinka - Baco/Jinka Airport","Ethiopia","BCO"]
[null,"Jinzhou - Jinzhou Airport","PR China","JNZ"]
[null,"Jipijapa","Ecuador","JIP"]
[null,"Jiri","Nepal","JIR"]
[null,"Jiujiang - Jiujiang Lushan Airport","PR China","JIU"]
[null,"Jiwani","Pakistan","JIW"]
[null,"Joacaba","Brazil","JCB"]
[null,"Joao Pessoa - Castro Pinto Airport","Brazil","JPA"]
[null,"Jodhpur","India","JDH"]
[null,"Jönköping (Jonkoping) - Axamo Airport","Sweden","JKG"]
[null,"Joensuu","Finland","JOE"]
[null,"Johannesburg - OR Tambo International Airport","South Africa","JNB"]
[null,"Johnson City (NY) - Binghamton/Endicott/Johnson","USA","BGM"]
[null,"Johnston Island","USA","JON"]
[null,"Johnstown (PA)","USA","JST"]
[null,"Johor Bahru - Sultan Ismail International","Malaysia","JHB"]
[null,"Joinville - Cubatao Airport","Brazil","JOI"]
[null,"Jolo","Philippines","JOL"]
[null,"Jomsom","Nepal","JMO"]
[null,"Jonesboro (AR)  Jonesboro Airport","USA","JBR"]
[null,"Joplin (MO)","USA","JLN"]
[null,"Jorhat - Rowriah Airport","India","JRH"]
[null,"Jos","Nigeria","JOS"]
[null,"Jose De San Martin","Argentina","JSM"]
[null,"Jouf","Saudi Arabia","AJF"]
[null,"Juanjui","Peru","JJI"]
[null,"Juba","South Sudan","JUB"]
[null,"Juist (island)","Germany","JUI"]
[null,"Juiz De Fora - Francisco De Assis Airport","Brazil","JDF"]
[null,"Jujuy - El Cadillal Airport","Argentina","JUJ"]
[null,"Julia Creek","Australia","JCK"]
[null,"Juliaca","Peru","JUL"]
[null,"Jumla","Nepal","JUM"]
[null,"Jundah","Australia","JUN"]
[null,"Juneau (AK) - Juneau International Airport","USA","JNU"]
[null,"Junin","Argentina","JNI"]
[null,"Juticalpa","Honduras","JUT"]
[null,"Jwaneng","Botswana","JWA"]
[null,"Jyväskylä (Jyvaskyla)","Finland","JYV"]
[]
[null,"K"]
[null,"Kabul - Khwaja Rawash Airport","Afghanistan","KBL"]
[null,"Kagoshima","Japan","KOJ"]
[null,"Kahramanmaras","Turkey","KCM"]
[null,"Kahului (HI)","USA","OGG"]
[null,"Kajaani","Finland","KAJ"]
[null,"Kalamata","Greece","KLX"]
[null,"Kalamazoo/Battle Creek (MI)","USA","AZO"]
[null,"Kalgoorlie","Australia","KGI"]
[null,"Kaliningrad","Russia","KGD"]
[null,"Kalispell (MT)","USA","FCA"]
[null,"Kalmar","Sweden","KLR"]
[null,"Kamloops, BC","Canada","YKA"]
[null,"Kamuela (HI)","USA","MUE"]
[null,"Kano","Nigeria","KAN"]
[null,"Kanpur","India","KNU"]
[null,"Kansas City (MO) - Kansas City International Airport","USA","MCI"]
[null,"Kaohsiung International","Taiwan","KHH"]
[null,"Kapalua West (HI)","USA","JHM"]
[null,"Karachi - Jinnah International Airport","Pakistan","KHI"]
[null,"Karlsruhe-Baden - Soellingen","Germany","FKB"]
[null,"Karlstad","Sweden","KSD"]
[null,"Karpathos","Greece","AOK"]
[null,"Karratha","Australia","KTA"]
[null,"Kars","Turkey","KYS"]
[null,"Karumba","Australia","KRB"]
[null,"Karup","Denmark","KRP"]
[null,"Kaschechawan, PQ","Canada","ZKE"]
[null,"Kassala","Sudan","KSL"]
[null,"Katherine","Australia","KTR"]
[null,"Kathmandu - Tribhuvan International Airport","Nepal","KTM"]
[null,"Katima Mulilo/Mpacha","Namibia","MPA"]
[null,"Kauhajoki","Finland","KHJ"]
[null,"Kaunakakai (HI)","USA","MKK"]
[null,"Kavalla","Greece","KVA"]
[null,"Kayseri","Turkey","ASR"]
[null,"Kazan - Kazan International Airport","Russia","KZN"]
[null,"Keetmanshoop","Namibia","KMP"]
[null,"Kelowna, BC","Canada","YLW"]
[null,"Kemi/Tornio","Finland","KEM"]
[null,"Kenai (AK)","USA","ENA"]
[null,"Kent (Manston) Kent International","United Kingdom","MSE"]
[null,"Kerry County","Ireland","KIR"]
[null,"Ketchikan (AK)","USA","KTN"]
[null,"Key West (FL)","USA","EYW"]
[null,"Khamis Mushayat","Saudi Arabia","AHB"]
[null,"Kharga - New Valley","Egypt","UVL"]
[null,"Kharkov","Ukraine","HRK"]
[null,"Khartoum - Khartoum International Airport","Sudan","KRT"]
[null,"Khuzdar","Pakistan","KDD"]
[null,"Kiel - Holtenau","Germany","KEL"]
[null,"Kiev - Borispol","Ukraine","KBP"]
[null,"Kiev - Zhulhany","Ukraine","IEV"]
[null,"Kigali - Gregoire Kayibanda","Rwanda","KGL"]
[null,"Kilimadjaro","Tanzania","JRO"]
[null,"Killeem (TX)","USA","ILE"]
[null,"Kimberley","South Africa","KIM"]
[null,"King Island","King Island (Australia)","KNS"]
[null,"King Salomon (AK)","USA","AKN"]
[null,"Kingscote","Australia","KGC"]
[null,"Kingston - Norman Manley","Jamaica","KIN"]
[null,"Kingston (NC)","USA","ISO"]
[null,"Kingstown - E. T. Joshua Airport","Saint Vincent and the Grenadines","SVD"]
[null,"Kinshasa - N'Djili","Congo (DRC)","FIH"]
[null,"Kiritimati (island) - Cassidy International Airport","Kiribati","CXI"]
[null,"Kirkenes","Norway","KKN"]
[null,"Kirkuk","Iraq","KIK"]
[null,"Kirkwall (Orkney)","United Kingdom","KOI"]
[null,"Kiruna","Sweden","KRN"]
[null,"Kisangani","Congo (DRC)","FKI"]
[null,"Kismayo","Somalia","KMU"]
[null,"Kittilä","Finland","KTT"]
[null,"Kitwe","Zambia","KIW"]
[null,"Klagenfurt","Austria","KLU"]
[null,"Klamath Fall (OR)","USA","LMT"]
[null,"Klawock (AK)","USA","KLW"]
[null,"Kleinsee","South Africa","KLZ"]
[null,"Knock","Ireland","NOC"]
[null,"Knoxville (TN)","USA","TYS"]
[null,"Kobe","Japan","UKB"]
[null,"Kochi","Japan","KCZ"]
[null,"Köln, Köln/Bonn","Germany","CGN"]
[null,"Kodiak (AK)","USA","ADQ"]
[null,"Kohat","Pakistan","OHT"]
[null,"Kokkola/Pietarsaari","Finland","KOK"]
[null,"Kolkata (Calcutta) - Netaji Subhas Chandra","India","CCU"]
[null,"Komatsu","Japan","KMQ"]
[null,"Kona (HI)","USA","KOA"]
[null,"Konya","Turkey","KYA"]
[null,"Korhogo","Cote d'Ivoire","HGO"]
[null,"Kos","Greece","KGS"]
[null,"Kota Kinabalu","Malaysia","BKI"]
[null,"Kotzbue (AK)","USA","OTZ"]
[null,"Kowanyama","Australia","KWM"]
[null,"Krakow (Cracow) - John Paul II International Airport","Poland","KRK"]
[null,"Kristiansand","Norway","KRS"]
[null,"Kristianstad","Sweden","KID"]
[null,"Kristiansund","Norway","KSU"]
[null,"Kuala Lumpur - International Airport","Malaysia","KUL"]
[null,"Kuala Lumpur - Sultan Abdul Aziz Shah","Malaysia","SZB"]
[null,"Kuantan","Malaysia","KUA"]
[null,"Kuching","Malaysia","KCH"]
[null,"Kumamoto","Japan","KMJ"]
[null,"Kununurra","Australia","KNX"]
[null,"Kuopio","Finland","KUO"]
[null,"Kushiro","Japan","KUH"]
[null,"Kuujjuaq (FortChimo)","Canada","YVP"]
[null,"Kuujjuarapik","Canada","YGW"]
[null,"Kuusamo","Finland","KAO"]
[null,"Kuwait - Kuwait International","Kuwait","KWI"]
[null,"Kyoto","Japan","UKY"]
[]
[]
[null,"Amelia : Are you coming or going? Viktor Navorski : I don't know. Both."]
[null,"The Terminal (Movie with Tom Hanks)"]
[]
[]
[]
[null,"L"]
[null,"Labe","Guinea","LEK"]
[null,"Labouchere Bay (AK)","USA","WLB"]
[null,"Labuan","Malaysia","LBU"]
[null,"Lac Brochet, MB","Canada","XLB"]
[null,"La Coruna","Spain","LCG"]
[null,"La Crosse (WI)","USA","LSE"]
[null,"Lae - Lae Nadzab Airport","Papua New Guinea","LAE"]
[null,"La Rochelle","France","LRH"]
[null,"Lafayette (IN)","USA","LAF"]
[null,"Lafayette, La","USA","LFT"]
[null,"Lagos - Murtala Muhammed Airport","Nigeria","LOS"]
[null,"La Grande","Canada","YGL"]
[null,"Lahore","Pakistan","LHE"]
[null,"Lake Charles (LA)","USA","LCH"]
[null,"Lake Havasu City (AZ)","USA","HII"]
[null,"Lake Tahoe (CA)","USA","TVL"]
[null,"Lakselv","Norway","LKL"]
[null,"Lambarene","Gabon","LBQ"]
[null,"Lamezia Terme","Italy","SUF"]
[null,"Lampedusa","Italy","LMP"]
[null,"Lanai City (HI)","USA","LNY"]
[null,"Lancaster (PA)","USA","LNS"]
[null,"Land's End","United Kingdom","LEQ"]
[null,"Langkawi (islands)","Malaysia","LGK"]
[null,"Lannion","France","LAI"]
[null,"Lanseria","South Africa","HLA"]
[null,"Lansing (MI)","USA","LAN"]
[null,"La Paz - El Alto","Bolivia","LPB"]
[null,"La Paz - Leon","Mexico","LAP"]
[null,"Lappeenranta","Finland","LPP"]
[null,"Laramie (WY)","USA","LAR"]
[null,"Laredo (TX)","USA","LRD"]
[null,"Larnaca","Cyprus","LCA"]
[null,"Las Palmas","Spain","LPA"]
[null,"Las Vegas (NV)","USA","LAS"]
[null,"Latrobe (PA)","USA","LBE"]
[null,"Launceston","Australia","LST"]
[null,"Laurel/Hattisburg (MS)","USA","PIB"]
[null,"Laverton","Australia","LVO"]
[null,"Lawton (OK)","USA","LAW"]
[null,"Lazaro Cardenas","Mexico","LZC"]
[null,"Leaf Rapids","Canada","YLR"]
[null,"Learmouth (Exmouth)","Australia","LEA"]
[null,"Lebanon (NH)","USA","LEB"]
[null,"Leeds/Bradford","United Kingdom","LBA"]
[null,"Leinster","Australia","LER"]
[null,"Leipzig","Germany","LEJ"]
[null,"Lelystad","Netherlands","LEY"]
[null,"Leon","Mexico","BJX"]
[null,"Leonora","Australia","LNO"]
[null,"Lerwick/Tingwall (Shetland Islands)","United Kingdom","LWK"]
[null,"Lewiston (ID)","USA","LWS"]
[null,"Lewistown (MT)","USA","LWT"]
[null,"Lexington (KY)","USA","LEX"]
[null,"Libreville","Gabon","LBV"]
[null,"Lidkoeping","Sweden","LDK"]
[null,"Liege","Belgium","LGG"]
[null,"Lifou","Loyaute, Pazifik","LIF"]
[null,"Lihue (HI)","USA","LIH"]
[null,"Lille - Lille Airport","France","LIL"]
[null,"Lilongwe - Lilongwe International","Malawi","LLW"]
[null,"Lima - J Chavez International","Peru","LIM"]
[null,"Limassol","Cyprus","QLI"]
[null,"Limoges","France","LIG"]
[null,"Lincoln (NE)","USA","LNK"]
[null,"Lindeman Island","Australia","LDC"]
[null,"Linz - Hoersching","Austria","LNZ"]
[null,"Lisala","Congo (DRC)","LIQ"]
[null,"Lisbon - Lisboa","Portugal","LIS"]
[null,"Lismore","Australia","LSY"]
[null,"Little Rock (AR)","USA","LIT"]
[null,"Liverpool","United Kingdom","LPL"]
[null,"Lizard Island","Australia","LZR"]
[null,"Ljubljana - Brnik","Slovenia","LJU"]
[null,"Lockhart River","Australia","IRG"]
[null,"Lome","Togo","LFW"]
[null,"London","Canada","YXU"]
[null,"London Metropolitan Area","United Kingdom","LON"]
[null,"London - City Airport","United Kingdom","LCY"]
[null,"London - Gatwick","United Kingdom","LGW"]
[null,"London - Heathrow","United Kingdom","LHR"]
[null,"London - Luton","United Kingdom","LTN"]
[null,"London - Stansted","United Kingdom","STN"]
[null,"Londonderry - Eglinton","United Kingdom","LDY"]
[null,"Long Beach (CA)","USA","LGB"]
[null,"Long Island (AK)","USA","LIJ"]
[null,"Long Island, Islip (NY) - Mac Arthur","USA","ISP"]
[null,"Longreach","Australia","LRE"]
[null,"Longview/Kilgore (TX)","USA","GGG"]
[null,"Longyearbyen - Svalbard","Svalbard/Norway","LYR"]
[null,"Loreto","Mexico","LTO"]
[null,"Lorient","France","LRT"]
[null,"Los Angeles (CA) - International","USA","LAX"]
[null,"Los Cabos","Mexico","SJD"]
[null,"Los Mochis","Mexico","LMM"]
[null,"Los Rodeos","Teneriffa/Spain","TFN"]
[null,"Losinj - Losinj Arpt","Croatia (Hrvatska)","LSZ"]
[null,"Lourdes/Tarbes","France","LDE"]
[null,"Louisville (KY)","USA","SDF"]
[null,"Luanda - 4 de Fevereiro","Angola","LAD"]
[null,"Lubbock (TX)","USA","LBB"]
[null,"Lucknow","India","LKO"]
[null,"Luederitz","Namibia","LUD"]
[null,"Luga","Malta","MLA"]
[null,"Lugano","Switzerland","LUG"]
[null,"Lulea","Sweden","LLA"]
[null,"Lumbumbashi","Congo (DRC)","FBM"]
[null,"Lusaka - Lusaka International Airport","Zambia","LUN"]
[null,"Lusisiki","South Africa","LUJ"]
[null,"Luxembourg","Luxembourg","LUX"]
[null,"Luxi - Mangshi","Yunnan, PR China","LUM"]
[null,"Luxor","Egypt","LXR"]
[null,"Lvov (Lwow, Lemberg)","Ukraine","LWO"]
[null,"Lydd - Lydd International Airport","United Kingdom","LYX"]
[null,"Lynchburg (VA)","USA","LYH"]
[null,"Lyon - Lyon-Saint Exupéry Airport ","France","LYS"]
[null,"Lyons (KS) - Rice County Municipal","USA","LYO"]
[]
[null,"M"]
[null,"Maastricht/Aachen","Netherlands","MST"]
[null,"Macapa - Alberto Alcolumbre International Airport","Brazil","MCP"]
[null,"Macau - Macau International Airport","Macau, China SAR","MFM"]
[null,"Maceio - Zumbi dos Palmares International Airport","Brazil","MCZ"]
[null,"Mackay","Australia","MKY"]
[null,"Macon (GA)","USA","MCN"]
[null,"Mactan Island - Nab","Philippines","NOP"]
[null,"Madinah (Medina) - Mohammad Bin Abdulaziz","Saudi Arabia","MED"]
[null,"Madison (WI) - Dane County Regional Airport","USA","MSN"]
[null,"Madras (Chennai) - Chennai International Airport","India","MAA"]
[null,"Madrid - Barajas Airport","Spain","MAD"]
[null,"Mahe - Seychelles International","Seychelles","SEZ"]
[null,"Mahon","Spain","MAH"]
[null,"Maitland","Australia","MTL"]
[null,"Majunga","Madagascar","MJN"]
[null,"Makung","Taiwan","MZG"]
[null,"Malabo - Malabo International Airport","Equatorial Guinea","SSG"]
[null,"Malaga","Spain","AGP"]
[null,"Malatya","Turkey","MLX"]
[null,"Male - Velana International Airport","Maledives","MLE"]
[null,"Malindi","Kenya","MYD"]
[null,"Malmo (Malmoe)","Sweden","MMA"]
[null,"Malmo (Malmö) - Malmö Airport","Sweden","MMX"]
[null,"Man","Cote d'Ivoire","MJC"]
[null,"Managua - Augusto C Sandino","Nicaragua","MGA"]
[null,"Manaus - Eduardo Gomes International Airport","Brazil","MAO"]
[null,"Manchester","United Kingdom","MAN"]
[null,"Manchester (NH)","USA","MHT"]
[null,"Mandalay - Mandalay-Annisaton Airport","Myanmar","MDL"]
[null,"Manguna","Papua New Guinea","MFO"]
[null,"Manihi","French Polynesia","XMH"]
[null,"Manila - Ninoy Aquino International","Philippines","MNL"]
[null,"Manzanillo","Mexico","ZLO"]
[null,"Manzini - Matsapha International","Swaziland","MTS"]
[null,"Maputo - Maputo International","Mozambique","MPM"]
[null,"Mar del Plata","Argentina","MDQ"]
[null,"Maracaibo - La Chinita International","Venezuela","MAR"]
[null,"Maradi","Niger","MFQ"]
[null,"Maras","Turkey","KCM"]
[null,"Marathon (FL)","USA","MTH"]
[null,"Mardin","Turkey","MQM"]
[null,"Mare","New Caledonia","MEE"]
[null,"Margate","South Africa","MGH"]
[null,"Margerita","Venezuela","PMV"]
[null,"Maribor","Slovenia","MBX"]
[null,"Mariehamn (Maarianhamina)","Finland","MHQ"]
[null,"Maroua","Cameroon","MVR"]
[null,"Marquette (MI)","USA","MQT"]
[null,"Marrakesh - Menara Airport","Morocco","RAK"]
[null,"Marsa Alam","Egypt","RMF"]
[null,"Marsa Matrah (Marsa Matruh)","Egypt","MUH"]
[null,"Marseille - Marseille Provence Airport","France","MRS"]
[null,"Marsh Harbour","Bahamas","MHH"]
[null,"Martha's Vineyard (MA)","USA","MVY"]
[null,"Martinsburg (WV)","USA","MRB"]
[null,"Maryborough","Australia","MBH"]
[null,"Maseru - Moshoeshoe International","Lesotho","MSU"]
[null,"Mason City IA","USA","MCW"]
[null,"Masvingo","Zimbabwe","MVZ"]
[null,"Matsumoto, Nagano","Japan","MMJ"]
[null,"Matsuyama","Japan","MYJ"]
[null,"Mattoon (IL)","USA","MTO"]
[null,"Maun","Botswana","MUB"]
[null,"Maupiti","French Polynesia","MAU"]
[null,"Mauritius - S.Seewoosagur Ram International","Mauritius","MRU"]
[null,"Mayaguez","Puerto Rico","MAZ"]
[null,"Mazatlan","Mexico","MZT"]
[null,"McAllen (TX)","USA","MFE"]
[null,"Medan - Polania Int'l (now Soewondo AFB)","Indonesia","MES"]
[null,"Medan - Kualanamu International","Indonesia","KNO"]
[null,"Medellin - José María Córdova International","Colombia","MDE"]
[null,"Medford (OR)","USA","MFR"]
[null,"Medina","Saudi Arabia","MED"]
[null,"Meekatharra","Australia","MKR"]
[null,"Melbourne - Melbourne Airport (Tullamarine)","Australia","MEL"]
[null,"Melbourne (FL)","USA","MLB"]
[null,"Melville Hall","Dominica","DOM"]
[null,"Memphis (TN)","USA","MEM"]
[null,"Mendoza","Argentina","MDZ"]
[null,"Manado","Indonesia","MDC"]
[null,"Merced (CA)","USA","MCE"]
[null,"Merida","Mexico","MID"]
[null,"Meridian (MS)","USA","MEI"]
[null,"Merimbula","Australia","MIM"]
[null,"Messina","South Africa","MEZ"]
[null,"Metlakatla (AK)","USA","MTM"]
[null,"Metz -  Frescaty","France","MZM"]
[null,"Metz/Nancy Metz-Nancy-Lorraine","France","ETZ"]
[null,"Mexicali","Mexico","MXL"]
[null,"Mexico City - Mexico City International Airport","Mexico","MEX"]
[null,"Mexico City - Atizapan","Mexico","AZP"]
[null,"Mexico City - Juarez International","Mexico","MEX"]
[null,"Mexico City - Santa Lucia","Mexico","NLU"]
[null,"Mfuwe","Zambia","MFU"]
[null,"Miami (FL)","USA","MIA"]
[null,"Mianwali","Pakistan","MWD"]
[null,"Middlemount","Australia","MMM"]
[null,"Midland/Odessa (TX)","USA","MAF"]
[null,"Midway Island - Sand Island Field","US Minor Outlying Islands","MDY"]
[null,"Mikkeli","Finland","MIK"]
[null,"Milan","Italy","MIL"]
[null,"Milan - Linate","Italy","LIN"]
[null,"Milan - Malpensa","Italy","MXP"]
[null,"Milan - Orio Al Serio","Italy","BGY"]
[null,"Mildura","Australia","MQL"]
[null,"Miles City (MT)","USA","MLS"]
[null,"Milford Sound","New Zealand","MFN"]
[null,"Milwaukee (WI)","USA","MKE"]
[null,"Minatitlan","Mexico","MTT"]
[null,"Mineralnye Vody","Russia","MRV"]
[null,"Minneapolis - St. Paul International Airport (MN)","USA","MSP"]
[null,"Minot (ND)","USA","MOT"]
[null,"Minsk, International","Belarus","MSQ"]
[null,"Miri","Malaysia","MYY"]
[null,"Mirpur","Pakistan","QML"]
[null,"Missula (MT)","USA","MSO"]
[null,"Mitchell (SD)","USA","MHE"]
[null,"Miyako Jima (Ryuku Islands) - Hirara","Japan","MMY"]
[null,"Miyazaki","Japan","KMI"]
[null,"Mkambati","South Africa","MBM"]
[null,"Moanda","Gabon","MFF"]
[null,"Mobile (AL) - Pascagoula (MS)","USA","MOB"]
[null,"Modesto (CA)","USA","MOD"]
[null,"Moenjodaro","Pakistan","MJD"]
[null,"Mogadishu","Somalia","MGQ"]
[null,"Mokuti","Namibia","OKU"]
[null,"Moline/Quad Cities (IL)","USA","MLI"]
[null,"Mombasa - Moi International","Kenya","MBA"]
[null,"Monastir","Tunisia","MIR"]
[null,"Moncton","Canada","YQM"]
[null,"Monroe (LA)","USA","MLU"]
[null,"Monrovia - Metropolitan Area","Liberia","MLW"]
[null,"Monrovia - Roberts International","Liberia","ROB"]
[null,"Montego Bay - Sangster International","Jamaica","MBJ"]
[null,"Montenegro","Brazil","QGF"]
[null,"Monterey (CA)","USA","MRY"]
[null,"Monterrey - Gen. Mariano Escobedo","Mexico","MTY"]
[null,"Monterrey - Aeropuerto Del Norte","Mexico","NTR"]
[null,"Montevideo - Carrasco International Airport","Uruguay","MVD"]
[null,"Montgomery (AL) - Montgomery Regional Airport","USA","MGM"]
[null,"Montpellier - Montpellier–Méditerranée Airport","France","MPL"]
[null,"Montreal","Canada","YMQ"]
[null,"Montreal - Dorval (Montréal-Trudeau)","Canada","YUL"]
[null,"Montreal - Mirabel","Canada","YMX"]
[null,"Montrose/Tellruide (CO)","USA","MTJ"]
[null,"Moorea","French Polynesia","MOZ"]
[null,"Moranbah","Australia","MOV"]
[null,"Moree","Australia","MRZ"]
[null,"Morelia","Mexico","MLM"]
[null,"Morgantown (WV)","USA","MGW"]
[null,"Morioka, Hanamaki","Japan","HNA"]
[null,"Moroni - Prince Said Ibrahim","Comoros (Comores)","HAH"]
[null,"Moruya","Australia","MYA"]
[null,"Moscow - Metropolitan Area","Russia","MOW"]
[null,"Moscow - Domodedovo","Russia","DME"]
[null,"Moscow - Sheremetyevo","Russia","SVO"]
[null,"Moscow - Vnukovo","Russia","VKO"]
[null,"Moses Lake (WA)","USA","MWH"]
[null,"Mossel Bay","South Africa","MZY"]
[null,"Mostar","Bosnia and Herzegovina","OMO"]
[null,"Mosul","Iraq","OSM"]
[null,"Mouila","Gabon","MJL"]
[null,"Moundou","Chad","MQQ"]
[null,"Mount Cook","New Zealand","GTN"]
[null,"Mount Gambier","Australia","MGB"]
[null,"Mount Magnet","Australia","MMG"]
[null,"Mt. Isa","Australia","ISA"]
[null,"Mt. McKinley (AK)","USA","MCL"]
[null,"Muenchen (Munich) - Franz Josef Strauss","Germany","MUC"]
[null,"Muenster/Osnabrueck","Germany","FMO"]
[null,"Mulhouse","France","MLH"]
[null,"Multan","Pakistan","MUX"]
[null,"Murcia","Spain","MJV"]
[null,"Murmansk","Russia","MMK"]
[null,"Mus","Turkey","MSR"]
[null,"Muscat - Seeb","Oman","MCT"]
[null,"Muscle Shoals (AL)","USA","MSL"]
[null,"Muskegon (MI)","USA","MKG"]
[null,"Muzaffarabad","Pakistan","MFG"]
[null,"Mvengue","Gabon","MVB"]
[null,"Mwanza","Tanzania","MWZ"]
[null,"Mykonos","Greece","JMK"]
[null,"Myrtle Beach (SC) - Myrtle Beach AFB","USA","MYR"]
[null,"Myrtle Beach (SC) - Grand Strand Airport","USA","CRE"]
[null,"Mysore","India","MYQ"]
[null,"Mytilene (Lesbos)","Greece","MJT"]
[null,"Mzamba","South Africa","MZF"]
[]
[]
[null,"I heard an airplane passing overhead. I wished I was on it."]
[null,"Charles Bukowski"]
[]
[]
[]
[null,"N"]
[null,"Nadi","Fiji","NAN"]
[null,"Nagasaki","Japan","NGS"]
[null,"Nagoya - Komaki AFB","Japan","NGO"]
[null,"Nagpur","India","NAG"]
[null,"Nairobi","Kenya","NBO"]
[null,"Nakhichevan","Azerbaijan","NAJ"]
[null,"Nakhon Si Thammarat","Thailand","NST"]
[null,"Nancy","France","ENC"]
[null,"Nanisivik","Canada","YSR"]
[null,"Nanning","Guangxi, PR China","NNG"]
[null,"Nantes - Nantes Atlantique Airport","France","NTE"]
[null,"Nantucket (MA)","USA","ACK"]
[null,"Naples - Naples Capodichino Airport","Italy","NAP"]
[null,"Naples (FL)","USA","APF"]
[null,"Narrabri","Australia","NAA"]
[null,"Narrandera","Australia","NRA"]
[null,"Narsarsuaq","Greenland","UAK"]
[null,"Nashville (TN)","USA","BNA"]
[null,"Nassau","Bahamas","NAS"]
[null,"Natal - Augusto Severo International Airport","Brazil","NAT"]
[null,"Nausori","Fiji/Suva","SUV"]
[null,"Nawab Shah","Pakistan","WNS"]
[null,"Naxos - Naxos Airport","Greece","JNX"]
[null,"N'Djamena","Chad","NDJ"]
[null,"N'Dola","Zambia","NLA"]
[null,"Nelson","New Zealand","NSN"]
[null,"Nelspruit","South Africa","NLP"]
[null,"Nelspruit - Kruger Mpumalanga International Airport","South Africa","MQP"]
[null,"Nevis","St. Kitts and Nevis","NEV"]
[null,"New Bern (NC)","USA","EWN"]
[null,"New Haven (CT)","USA","HVN"]
[null,"New Orleans, La","USA","MSY"]
[null,"Newquay","United Kingdom","NQY"]
[null,"New Valley - Kharga","Egypt","UVL"]
[null,"New York - John F. Kennedy (NY)","USA","JFK"]
[null,"New York - LaGuardia (NY)","USA","LGA"]
[null,"New York - Newark (NJ)","USA","EWR"]
[null,"New York (NY)","USA","NYC"]
[null,"Newburgh (NY)","USA","SWF"]
[null,"Newcastle - Belmont","Australia","BEO"]
[null,"Newcastle - Williamtown","Australia","NTL"]
[null,"Newcastle","United Kingdom","NCL"]
[null,"Newcastle","South Africa","NCS"]
[null,"Newman","Australia","ZNE"]
[null,"Newport News/Williamsburg (VA)","USA","PHF"]
[null,"N'Gaoundere","Cameroon","NGE"]
[null,"Niagara Falls International","USA","IAG"]
[null,"Niamey","Niger","NIM"]
[null,"Nice - Cote D'Azur Airport","France","NCE"]
[null,"Nicosia","Cyprus","NIC"]
[null,"Nikolaev","Ukraine","NLV"]
[null,"Niigata","Japan","KIJ"]
[null,"Nimes","France","FNI"]
[null,"Nis","Serbia","INI"]
[null,"Nizhny Novgorod - Strigino International Airport","Russia","GOJ"]
[null,"Nome (AK)","USA","OME"]
[null,"Noosa","Australia","NSA"]
[null,"Norfolk Island","Australia","NLK"]
[null,"Norfolk/Virginia Beach (VA)","USA","ORF"]
[null,"Norman Wells","Canada","YVQ"]
[null,"Norrkoeping","Sweden","NRK"]
[null,"North Bend (OR)","USA","OTH"]
[null,"North Eleuthera","Bahamas","ELH"]
[null,"Norwich","United Kingdom","NWI"]
[null,"Nottingham - East Midlands","United Kingdom","EMA"]
[null,"Nouadhibou","Mauritania","NDB"]
[null,"Nouakchott","Mauritania","NKC"]
[null,"Noumea","New Caledonia","NOU"]
[null,"Novi Sad","Serbia","QND"]
[null,"Novosibirsk - Tolmachevo Airport","Russia","OVB"]
[null,"Nürnberg (Nuremberg)","Germany","NUE"]
[null,"Nuevo Laredo","Mexico","NLD"]
[null,"Nuku'alofa - Fua'Amotu International","Tonga","TBU"]
[]
[null,"O"]
[null,"Oakland (CA)","USA","OAK"]
[null,"Oaxaca - Xoxocotlan","Mexico","OAX"]
[null,"Odense","Denmark","ODE"]
[null,"Odessa","Ukraine","ODS"]
[null,"Oerebro","Sweden","ORB"]
[null,"Ohrid","Macedonia","OHD"]
[null,"Oita","Japan","OIT"]
[null,"Okayama","Japan","OKJ"]
[null,"Okinawa, Ryukyo Island - Naha","Japan","OKA"]
[null,"Oklahoma City (OK) - Will Rogers World","USA","OKC"]
[null,"Olbia","Italy","OLB"]
[null,"Olympic Dam","Australia","OLP"]
[null,"Omaha (NE)","USA","OMA"]
[null,"Ondangwa","Namibia","OND"]
[null,"Ontario (CA)","USA","ONT"]
[null,"Oran (Ouahran)","Algeria","ORN"]
[null,"Orange","Australia","OAG"]
[null,"Orange County (Santa Ana) (CA)","USA","SNA"]
[null,"Oranjemund","Namibia","OMD"]
[null,"Oranjestad - Reina Beatrix International","Aruba","AUA"]
[null,"Orkney - Kirkwall","United Kingdom","KOI"]
[null,"Orlando Metropolitan Area (FL)","USA","ORL"]
[null,"Orlando - International Airport (FL)","USA","MCO"]
[null,"Orpheus Island","Australia","ORS"]
[null,"Osaka, Metropolitan Area","Japan","OSA"]
[null,"Osaka - Itami","Japan","ITM"]
[null,"Osaka - Kansai International Airport","Japan","KIX"]
[null,"Oshkosh (WI)","USA","OSH"]
[null,"Osijek","Croatia (Hrvatska)","OSI"]
[null,"Oslo - Oslo Airport, Gardermoen","Norway","OSL"]
[null,"Oslo - Fornebu","Norway","FBU"]
[null,"Oslo - Sandefjord","Norway","TRF"]
[null,"Ostend","Belgium","OST"]
[null,"Ottawa - Hull","Canada","YOW"]
[null,"Ouadda","Central African Republic","ODA"]
[null,"Ouarzazate","Morocco","OZZ"]
[null,"Oudtshoorn","South Africa","OUH"]
[null,"Ouagadougou","Burkina Faso","OUA"]
[null,"Oujda","Morocco","OUD"]
[null,"Oulu","Finland","OUL"]
[null,"Out Skerries (Shetland)","United Kingdom","OUK"]
[null,"Oviedo","Spain","OVD"]
[null,"Owensboro (KY)","USA","OWB"]
[null,"Oxnard (CA)","USA","OXR"]
[null,"Oyem","Gabon/Loyautte","UVE"]
[]
[]
[null,"A lie can travel half way around the world while the truth is putting on its shoes."]
[null,"Charles Spurgeon"]
[]
[]
[]
[null,"P"]
[null,"Paderborn/Lippstadt","Germany","PAD"]
[null,"Paducah (KY)","USA","PAH"]
[null,"Page/Lake Powell (AZ)","USA","PGA"]
[null,"Pago Pago","American Samoa","PPG"]
[null,"Pakersburg (WV) /Marietta (OH)","USA","PKB"]
[null,"Palermo - Punta Raisi","Italy","PMO"]
[null,"Palma de Mallorca","Spain","PMI"]
[null,"Palmas","Brazil","PMW"]
[null,"Palmdale/Lancaster (CA)","USA","PMD"]
[null,"Palmerston North","New Zealand","PMR"]
[null,"Palm Springs (CA)","USA","PSP"]
[null,"Panama City - Tocumen International","Panama","PTY"]
[null,"Panama City (FL)","USA","PFN"]
[null,"Panjgur","Pakistan","PJG"]
[null,"Pantelleria","Italy","PNL"]
[null,"Papeete - Faaa","French Polynesia (Tahiti)","PPT"]
[null,"Paphos","Cyprus","PFO"]
[null,"Paraburdoo","Australia","PBO"]
[null,"Paramaribo - Zanderij International","Suriname","PBM"]
[null,"Paris","France","PAR"]
[null,"Paris - Charles de Gaulle","France","CDG"]
[null,"Paris - Le Bourget","France","LBG"]
[null,"Paris - Orly","France","ORY"]
[null,"Paro","Bhutan","PBH"]
[null,"Pasco (WA)","USA","PSC"]
[null,"Pasni","Pakistan","PSI"]
[null,"Patna","India","PAT"]
[null,"Pattaya","Thailand","PYX"]
[null,"Pau","France","PUF"]
[null,"Pellston (MI)","USA","PLN"]
[null,"Penang International","Malaysia","PEN"]
[null,"Pemba","Mozambique","POL"]
[null,"Pendelton (OR)","USA","PDT"]
[null,"Pensacola (FL)","USA","PNS"]
[null,"Peoria/Bloomington (IL)","USA","PIA"]
[null,"Pereira","Colombia","PEI"]
[null,"Perpignan","France","PGF"]
[null,"Perth International","Australia","PER"]
[null,"Perugia","Italy","PEG"]
[null,"Pescara","Italy","PSR"]
[null,"Peshawar","Pakistan","PEW"]
[null,"Petersburg (AK)","USA","PSG"]
[null,"Phalaborwa","South Africa","PHW"]
[null,"Philadelphia (PA) - International","USA","PHL"]
[null,"Phnom Penh - Pochentong","Cambodia","PNH"]
[null,"Phoenix (AZ) - Sky Harbor International","USA","PHX"]
[null,"Phuket","Thailand","HKT"]
[null,"Pierre (SD)","USA","PIR"]
[null,"Pietermaritzburg","South Africa","PZB"]
[null,"Pietersburg","South Africa","PTG"]
[null,"Pilanesberg/Sun City","South Africa","NTY"]
[null,"Pisa - Galileo Galilei","Italy","PSA"]
[null,"Pittsburgh International Airport (PA)","USA","PIT"]
[null,"Plattsburgh (NY)","USA","PLB"]
[null,"Plettenberg Bay","South Africa","PBZ"]
[null,"Pocatello (ID)","USA","PIH"]
[null,"Podgorica","Montenegro","TGD"]
[null,"Pohnpei","Micronesia","PNI"]
[null,"Pointe a Pitre","Guadeloupe","PTP"]
[null,"Pointe Noire","Congo (ROC)","PNR"]
[null,"Poitiers - Biard","France","PIS"]
[null,"Ponce","Puerto Rico","PSE"]
[null,"Ponta Delgada","Portugal","PDL"]
[null,"Pori","Finland","POR"]
[null,"Port Angeles (WA)","USA","CLM"]
[null,"Port au Prince","Haiti","PAP"]
[null,"Port Augusta","Australia","PUG"]
[null,"Port Elizabeth","South Africa","PLZ"]
[null,"Port Gentil","Gabon","POG"]
[null,"Port Harcourt","Nigeria","PHC"]
[null,"Port Hedland","Australia","PHE"]
[null,"Portland","Australia","PTJ"]
[null,"Portland (ME)","USA","PWM"]
[null,"Portland International (OR)","USA","PDX"]
[null,"Port Lincoln","Australia","PLO"]
[null,"Port Macquarie","Australia","PQQ"]
[null,"Port Menier, PQ","Canada","YPN"]
[null,"Port Moresby - Jackson Field","Papua New Guinea","POM"]
[null,"Porto","Portugal","OPO"]
[null,"Porto Alegre - Salgado Filho International Airport","Brazil","POA"]
[null,"Port of Spain - Piarco International","Trinidad and Tobago","POS"]
[null,"Port Said","Egypt","PSD"]
[null,"Porto Santo","Portugal","PXO"]
[null,"Porto Velho","Brazil","PVH"]
[null,"Port Vila","Vanuatu","VLI"]
[null,"Poughkeepsie (NY)","USA","POU"]
[null,"Poznan, Lawica","Poland","POZ"]
[null,"Prague - Václav Havel Airport (formerly Ruzyne)","Czech Republic","PRG"]
[null,"Praia - Nelson Mandela International Airport","Cape Verde","RAI"]
[null,"Presque Island (ME)","USA","PQI"]
[null,"Pretoria - Wonderboom Apt.","South Africa","PRY"]
[null,"Preveza/Lefkas","Greece","PVK"]
[null,"Prince George","Canada","YXS"]
[null,"Prince Rupert/Digby Island","Canada","YPR"]
[null,"Pristina","Serbia","PRN"]
[null,"Prosperpine","Australia","PPP"]
[null,"Providence (RI)","USA","PVD"]
[null,"Prudhoe Bay (AK)","USA","SCC"]
[null,"Puebla","Mexico","PBC"]
[null,"Pueblo (CO)","USA","PUB"]
[null,"Puerto Escondido","Mexico","PXM"]
[null,"Puerto Ordaz","Venezuela","PZO"]
[null,"Puerto Plata","Dominican Republic","POP"]
[null,"Puerto Vallarta","Mexico","PVR"]
[null,"Pukatawagan","Canada","XPK"]
[null,"Pula","Croatia (Hrvatska)","PUY"]
[null,"Pullman (WA)","USA","PUW"]
[null,"Pune","India, Maharashtra","PNQ"]
[null,"Punta Arenas - Presidente Carlos Ibáñez del Campo","Chile","PUQ"]
[null,"Punta Cana - Punta Cana International","Dominican Republic","PUJ"]
[null,"Pu San (Busan) - Gimhae International Airport","South Korea","PUS"]
[null,"Pyongyang - Sunan International Airport","North Korea","FNJ"]
[]
[null,"Q"]
[null,"Quebec - Quebec International","Canada","YQB"]
[null,"Queenstown","Australia","UEE"]
[null,"Queenstown","New Zealand","ZQN"]
[null,"Quetta","Pakistan","UET"]
[null,"Qingdao","Shandong, PR China","TAO"]
[null,"Quimper","France","UIP"]
[null,"Quincy (IL)","USA","UIN"]
[null,"Quito - Mariscal Sucre International Airport","Ecuador","UIO"]
[]
[]
[null,"Travel makes a wise man better, and a fool worse."]
[null,"Thomas Fuller"]
[]
[]
[]
[null,"R"]
[null,"Rabat - Rabat-Salé Airport","Morocco","RBA"]
[null,"Rahim Yar Khan - Shaikh Zayed International Airport","Pakistan","RYK"]
[null,"Raiatea","French Polynesia","RFP"]
[null,"Rainbow Lake, AB","Canada","YOP"]
[null,"Rajkot","India","RAJ"]
[null,"Raleigh/Durham (NC)","USA","RDU"]
[null,"Ranchi","India","IXR"]
[null,"Rangiroa","French Polynesia","RGI"]
[null,"Rangoon (Yangon) - Mingaladon","Myanmar","RGN"]
[null,"Rapid City (SD)","USA","RAP"]
[null,"Rarotonga","Cook Island","RAR"]
[null,"Ras al Khaymah (Ras al Khaimah)","United Arab Emirates","RKT"]
[null,"Rawala Kot","Pakistan","RAZ"]
[null,"Rawalpindi","Pakistan","RWP"]
[null,"Reading (PA)","USA","RDG"]
[null,"Recife - Guararapes-Gilberto Freyre International","Brazil","REC"]
[null,"Redding (CA)","USA","RDD"]
[null,"Redmond (OR)","USA","RDM"]
[null,"Reggio Calabria","Italy","REG"]
[null,"Regina","Canada","YQR"]
[null,"Reina Sofia","Teneriffa/Spain","TFS"]
[null,"Rennes","France","RNS"]
[null,"Reno (NV)","USA","RNO"]
[null,"Resolute Bay","Canada","YRB"]
[null,"Reus","Spain","REU"]
[null,"Reykjavik - Metropolitan Area","Iceland","REK"]
[null,"Reykjavik - Keflavik International","Iceland","KEF"]
[null,"Rhinelander (WI)","USA","RHI"]
[null,"Rhodos","Greece","RHO"]
[null,"Richards Bay","South Africa","RCB"]
[null,"Richmond (VA)","USA","RIC"]
[null,"Riga","Latvia","RIX"]
[null,"Rijeka","Croatia (Hrvatska)","RJK"]
[null,"Rimini","Italy","RMI"]
[null,"Rio Branco - Plácido de Castro International Airport","Brazil","RBR"]
[null,"Rio de Janeiro - Galeao","Brazil","GIG"]
[null,"Rio de Janeiro - Santos Dumont","Brazil","SDU"]
[null,"Rio de Janeiro","Brazil","RIO"]
[null,"Riyadh - King Khaled International","Saudi Arabia","RUH"]
[null,"Roanne","France","RNE"]
[null,"Roanoke (VA)","USA","ROA"]
[null,"Roatan","Honduras","RTB"]
[null,"Rochester (MN)","USA","RST"]
[null,"Rochester (NY)","USA","ROC"]
[null,"Rock Sound","Bahamas","RSD"]
[null,"Rock Springs (WY)","USA","RKS"]
[null,"Rockford (IL)","USA","RFD"]
[null,"Rockhampton","Australia","ROK"]
[null,"Rockland (ME)","USA","RKD"]
[null,"Rocky Mount - Wilson (NC)","USA","RWI"]
[null,"Rodez","France","RDZ"]
[null,"Rodrigues Island","Mauritius","RRG"]
[null,"Roenne","Denmark","RNN"]
[null,"Rome","Italy","ROM"]
[null,"Rome - Ciampino","Italy","CIA"]
[null,"Rome - Fuimicino","Italy","FCO"]
[null,"Ronneby","Sweden","RNB"]
[null,"Rosario","Argentina","ROS"]
[null,"Rostov-on-Don - Rostov-on-Don Airport","Russia","RVI"]
[null,"Rostov-on-Don - Platov International Airport","Russia","ROV"]
[null,"Rotorua","New Zealand","ROT"]
[null,"Rotterdam","Netherlands","RTM"]
[null,"Rovaniemi","Finland","RVN"]
[null,"Rundu","Namibia","NDU"]
[null,"Ruse","Bulgaria","ROU"]
[]
[]
[null,"“It can hardly be a coincidence that no language on Earth has ever produced the expression \"as pretty as an airport\"."]
[null,"Douglas Adams"]
[]
[]
[]
[null,"S"]
[null,"Saarbruecken","Germany","SCN"]
[null,"Sacramento (CA)","USA","SMF"]
[null,"Sado Shima","Japan","SDS"]
[null,"Saginaw/Bay City/Midland (MI)","USA","MBS"]
[null,"Saidu Sharif","Pakistan","SDT"]
[null,"Saigon (Ho Chi Minh City) - Tan Son Nhat International","Viet Nam","SGN"]
[null,"Saint Brieuc","France","SBK"]
[null,"Saint Denis - Roland Garros Airport","Reunion","RUN"]
[null,"Saint John","Canada","YSJ"]
[null,"Saipan","Northern Mariana Islands","SPN"]
[null,"Sal","Cape Verde","SID"]
[null,"Salalah","Oman","SLL"]
[null,"Salem (OR)","USA","SLE"]
[null,"Salinas (CA)","USA","SNS"]
[null,"Salinas","Ecuador","SNC"]
[null,"Salisbury","Zimbabwe","SAY"]
[null,"Salisbury (MD)","USA","SBY"]
[null,"Saloniki","Greece","SKG"]
[null,"Salta, Gen Belgrano","Argentina","SLA"]
[null,"Salt Lake City (UT)","USA","SLC"]
[null,"Salvador - Salvador International Airport","Brazil","SSA"]
[null,"Salzburg - W.A. Mozart","Austria","SZG"]
[null,"Samara - Kurumoch International Airport","Russia","KUF"]
[null,"Samarkand - Samarkand International Airport","Uzbekistan","SKD"]
[null,"Samos","Greece","SMI"]
[null,"Samsun","Turkey","SZF"]
[null,"San Andres","Colombia","ADZ"]
[null,"San Angelo (TX)","USA","SJT"]
[null,"San Antonio (TX)","USA","SAT"]
[null,"San Carlos de Bariloche","Argentina","BRC"]
[null,"San Diego - Lindberg Field International (CA)","USA","SAN"]
[null,"San Francisco - International Airport, SA","USA","SFO"]
[null,"San Jose Cabo","Mexico","SJD"]
[null,"San Jose","Costa Rica","SJO"]
[null,"San Jose (CA)","USA","SJC"]
[null,"San Juan - Luis Munoz Marin International Airport","Puerto Rico","SJU"]
[null,"San Luis Obisco (CA)","USA","SBP"]
[null,"San Luis Potosi","Mexico","SLP"]
[null,"San Pedro","Cote d'Ivoire","SPY"]
[null,"San Pedro Sula","Honduras","SAP"]
[null,"San Salvador","Bahamas","ZSA"]
[null,"San Salvador","El Salvador","SAL"]
[null,"San Sebastian","Spain","EAS"]
[null,"Sanaa (Sana'a) - Sana'a International","Yemen","SAH"]
[null,"Sandspit","Canada","YZP"]
[null,"Santa Ana - John Wayne Airport (CA)","USA","SNA"]
[null,"Santa Barbara (CA)","USA","SBA"]
[null,"Santa Cruz de la Palma","Spain","SPC"]
[null,"Santa Cruz de la Sierra","Bolivia","SRZ"]
[null,"Santa Katarina - Mount Sinai","Egypt","SKV"]
[null,"Santa Maria","Portugal","SMA"]
[null,"Santa Maria (CA)","USA","SMX"]
[null,"Santander","Spain","SDR"]
[null,"Santa Rosa (CA)","USA","STS"]
[null,"Santa Rosa","Bolivia","SRB"]
[null,"Santa Rosa","Brazil","SRA"]
[null,"Santa Rosa","Argentina","RSA"]
[null,"Santa Rosa, Copan","Honduras","SDH"]
[null,"Santa Rosalia","Colombia","SSL"]
[null,"Santa Rosalia","Mexico","SRL"]
[null,"Santiago - Antonio Maceo Airport","Cuba","SCU"]
[null,"Santiago de Chile - Arturo Merino Benitez","Chile","SCL"]
[null,"Santiago de Compostela","Spain","SCQ"]
[null,"Santo","Vanuatu","SON"]
[null,"Santo Domingo","Dominican Republic","SDQ"]
[null,"Sao Luis - Marechal Cunha Machado International","Brazil","SLZ"]
[null,"Sao Paulo","Brazil","SAO"]
[null,"Sao Paulo - Congonhas","Brazil","CGH"]
[null,"Sao Paulo - Guarulhos","Brazil","GRU"]
[null,"Sao Paulo - Viracopos","Brazil","VCP"]
[null,"Sao Tome","Sao Tome & Principe","TMS"]
[null,"Sapporo","Hokkaido, Japan","SPK"]
[null,"Sapporo - Okadama","Hokkaido, Japan","OKD"]
[null,"Sapporo - New Chitose Airport","Japan","CTS"]
[null,"Sarajevo","Bosnia and Herzegovina","SJJ"]
[null,"Saransk - Saransk Airport","Russia","SKX"]
[null,"Sarasota/Bradenton (FL)","USA","SRQ"]
[null,"Saskatoon","Canada","YXE"]
[null,"Sassandra","Cote d'Ivoire","ZSS"]
[null,"Savannah (GA)","USA","SAV"]
[null,"Savonlinna","Finland","SVL"]
[null,"Scarborough - Crown Point International","Trinidad and Tobago","TAB"]
[null,"Scone","Australia","NSO"]
[null,"Scottsdale (AZ)","USA","SCF"]
[null,"Seattle/Tacoma (WA)","USA","SEA"]
[null,"Sehba","Libya","SEB"]
[null,"Seinaejoki","Finland","SJY"]
[null,"Selibi Phikwe","Botswana","PKW"]
[null,"Sendai","Japan","SDJ"]
[null,"Seoul - Incheon International Airport","South Korea","ICN"]
[null,"Seoul - Kimpo","South Korea","SEL"]
[null,"Sevilla","Spain","SVQ"]
[null,"Sfax","Tunisia","SFA"]
[null,"Shamattawa, MB","Canada","ZTM"]
[null,"Shanghai - Hongqiao","China","SHA"]
[null,"Shanghai - Pu Dong","China","PVG"]
[null,"Shannon (Limerick)","Ireland","SNN"]
[null,"Sharjah","United Arab Emirates","SHJ"]
[null,"Sharm El Sheikh","Egypt","SSH"]
[null,"Sheffield, City Airport","United Kingdom","SZD"]
[null,"Sheffield, Doncaster, Robin Hood International Airport","United Kingdom","DSA"]
[null,"Shenandoah Valley/Stauton (VA)","USA","SHD"]
[null,"Shenyang","Liaoning, PR China","SHE"]
[null,"Shenzhen - Shenzhen Bao'an International","Guangdong, PR China","SZX"]
[null,"Sheridan (WY)","USA","SHR"]
[null,"Shreveport, La","USA","SHV"]
[null,"Shute Harbour","Australia","JHQ"]
[null,"Sibu","Malaysia","SBW"]
[null,"Sidney (MT)","USA","SDY"]
[null,"Silistra","Bulgaria","SLS"]
[null,"Simferopol","Ukraine","SIP"]
[null,"Sindhri","Pakistan","MPD"]
[null,"Singapore - Changi","Singapore","SIN"]
[null,"Singapore - Paya Lebar","Singapore","QPG"]
[null,"Singapore - Seletar","Singapore","XSP"]
[null,"Singleton","Australia","SIX"]
[null,"Sioux City IA","USA","SUX"]
[null,"Sioux Falls (SD)","USA","FSD"]
[null,"Sishen","South Africa","SIS"]
[null,"Sitka (AK)","USA","SIT"]
[null,"Sivas","Turkey","VAS"]
[null,"Siwa","Egypt","SEW"]
[null,"Skagway (AK)","USA","SGY"]
[null,"Skardu","Pakistan","KDU"]
[null,"Skiathos","Greece","JSI"]
[null,"Skopje","Macedonia","SKP"]
[null,"Skrydstrup","Denmark","SKS"]
[null,"Skukuza","South Africa","SZK"]
[null,"Sligo","Ireland","SXL"]
[null,"Smithers","Canada","YYD"]
[null,"Sodankylae","Finland","SOT"]
[null,"Soenderborg","Denmark","SGD"]
[null,"Soendre Stroemfjord","Greenland","SFJ"]
[null,"Sofia - Vrazhdebna","Bulgaria","SOF"]
[null,"Sogndal","Norway","SOG"]
[null,"Southampton - Eastleigh","United Kingdom","SOU"]
[null,"South Bend (IN)","USA","SBN"]
[null,"South Indian Lake, MB","Canada","XSI"]
[null,"South Molle Island","Australia","SOI"]
[null,"Southend (London)","United Kingdom","SEN"]
[null,"Split","Croatia (Hrvatska)","SPU"]
[null,"Spokane (WA)","USA","GEG"]
[null,"Springbok","South Africa","SBU"]
[null,"Springfield (IL)","USA","SPI"]
[null,"Springfield (MO)","USA","SGF"]
[null,"Srinagar","India","SXR"]
[null,"Stendi Kisa","Kenya","EDL"]
[null,"St. Augustin, PQ","Canada","YIF"]
[null,"St. Croix","Virgin Islands (U.S.)","STX"]
[null,"St. Etienne","France","EBU"]
[null,"St. George (UT)","USA","SGU"]
[null,"St. John's","Canada","YYT"]
[null,"St. Kitts","St. Kitts and Nevis","SKB"]
[null,"St. Louis (MO) Lambert–St. Louis International Airport","USA","STL"]
[null,"St. Lucia Hewanorra","Saint Lucia","UVF"]
[null,"St. Lucia Vigle","Saint Lucia","SLU"]
[null,"St. Marteen","Netherlands Antilles","SXM"]
[null,"St. Martin","St. Martin (Guadeloupe)","SFG"]
[null,"St. Petersburg (Leningrad) - Pulkovo","Russia","LED"]
[null,"St. Pierre, NF","Canada","FSP"]
[null,"St. Thomas","Virgin Islands (U.S.)","STT"]
[null,"St. Vincent","Saint Vincent and the Grenadines","SVD"]
[null,"Stansted (London)","United Kingdom","STN"]
[null,"State College/Belefonte (PA)","USA","SCE"]
[null,"Stavanger","Norway","SVG"]
[null,"Steamboat Springs (CO)","USA","HDN"]
[null,"Stettin","Poland","SZZ"]
[null,"Stockholm Metropolitan Area","Sweden","STO"]
[null,"Stockholm - Arlanda","Sweden","ARN"]
[null,"Stockholm - Bromma","Sweden","BMA"]
[null,"Stockton (CA)","USA","SCK"]
[null,"Stornway","United Kingdom","SYY"]
[null,"Strasbourg - Strasbourg Airport","France","SXB"]
[null,"Streaky Bay","Australia","KBY"]
[null,"Stuttgart - Echterdingen","Germany","STR"]
[null,"Sui","Pakistan","SUL"]
[null,"Sukkur","Pakistan","SKZ"]
[null,"Sumburgh (Shetland)","United Kingdom","LSI"]
[null,"Sun Valley (ID)","USA","SUN"]
[null,"Sundsvall","Sweden","SDL"]
[null,"Sunshine Coast","Australia","MCY"]
[null,"Surabaya - Juanda","Indonesia","SUB"]
[null,"Surat","India","STV"]
[null,"Suva - Nausori Airport (Luvuluvu)","Fiji","SUV"]
[null,"Swakopmund","Namibia","SWP"]
[null,"Sydney - Sydney Airport","Australia","SYD"]
[null,"Sylhet","Bangladesh","ZYL"]
[null,"Syracuse (NY)","USA","SYR"]
[]
[null,"T"]
[null,"Tabuk","Saudi Arabia","TUU"]
[null,"Taif","Saudi Arabia","TIF"]
[null,"Taipei - Chiang Kai Shek","Taiwan","TPE"]
[null,"Taipei - Sung Shan","Taiwan","TAY"]
[null,"Taiyuan","Shanxi, PR China","TYN"]
[null,"Takamatsu","Japan","TAK"]
[null,"Talkeetna (AK)","USA","TKA"]
[null,"Tallahassee (FL)","USA","TLH"]
[null,"Tallinn - Pirita Harbour","Estonia","QUF"]
[null,"Tallinn - Ulemiste","Estonia","TLL"]
[null,"Tampa - International (FL)","USA","TPA"]
[null,"Tampere","Finland","TMP"]
[null,"Tampico - Gen. F. Javier Mina","Mexico","TAM"]
[null,"Tamworth","Australia","TMW"]
[null,"Tangier - Boukhalef","Morocco","TNG"]
[null,"Taree","Australia","TRO"]
[null,"Targovishte","Bulgaria","TGV"]
[null,"Tashkent - International","Uzbekistan","TAS"]
[null,"Tawau","Malaysia","TWU"]
[null,"Tbilisi - Novo Alexeyevka","Georgia","TBS"]
[null,"Te Anau","New Zealand","TEU"]
[null,"Teesside, Durham Tees Valley","United Kingdom","MME"]
[null,"Tegucigalpa","Honduras","TGU"]
[null,"Tehran (Teheran) - Mehrabad","Iran","THR"]
[null,"Tekirdag - Corlu","Turkey","TEQ"]
[null,"Tel Aviv - Ben Gurion International","Israel","TLV"]
[null,"Telluride (CO)","USA","TEX"]
[null,"Temora","Australia","TEM"]
[null,"Tenerife","Spain","TCI"]
[null,"Tenerife - Sur Reina Sofia","Spain","TFS"]
[null,"Tenerife - Norte Los Rodeos","Spain","TFN"]
[null,"Tennant Creek","Australia","TCA"]
[null,"Terceira","Portugal","TER"]
[null,"Teresina","Brazil","THE"]
[null,"Termez (Termes)","Uzbekistan","TMZ"]
[null,"Terrace","Canada","YXT"]
[null,"Terre Haute (IN)","USA","HUF"]
[null,"Texarkana (AR)","USA","TXK"]
[null,"Thaba'Nchu","South Africa","TCU"]
[null,"The Pas","Canada","YQD"]
[null,"Thessaloniki - Makedonia Apt.","Greece","SKG"]
[null,"Thief River Falls (MN)","USA","TVF"]
[null,"Thira","Greece","JTR"]
[null,"Thiruvananthapuram","India","TRV"]
[null,"Thisted","Denmark","TED"]
[null,"Thompson","Canada","YTH"]
[null,"Thorne Bay (AK)","USA","KTB"]
[null,"Thunder Bay","Canada","YQT"]
[null,"Thursday Island","Australia","TIS"]
[null,"Tianjin","China","TSN"]
[null,"Tijuana - Rodriguez","Mexico","TIJ"]
[null,"Tioman","Indonesia","TOD"]
[null,"Tirana - Rinas","Albania","TIA"]
[null,"Tiruchirapally","India","TRZ"]
[null,"Tivat","Montenegro","TIV"]
[null,"Tobago","Trinidad and Tobago","TAB"]
[null,"Tokushima","Japan","TKS"]
[null,"Tokyo","Japan","TYO"]
[null,"Tokyo - Haneda","Japan","HND"]
[null,"Tokyo - Narita","Japan","NRT"]
[null,"Toledo (OH)","USA","TOL"]
[null,"Tom Price","Australia","TPR"]
[null,"Toowoomba","Australia","TWB"]
[null,"Toronto - Billy Bishop Toronto City Airport","Canada","YTZ"]
[null,"Toronto - Toronto Pearson International Airport","Canada","YYZ"]
[null,"Toronto","Canada","YTO"]
[null,"Tortola","British Virgin Islands","TOV"]
[null,"Touho","New Caledonia","TOU"]
[null,"Toulouse - Blagnac Airport","France","TLS"]
[null,"Townsville","Australia","TSV"]
[null,"Toyama","Japan","TOY"]
[null,"Trabzon","Turkey","TZX"]
[null,"Trapani","Italy","TPS"]
[null,"Traverse City (MI)","USA","TVC"]
[null,"Treasure Cay","Bahamas","TCB"]
[null,"Trenton/Princeton (NJ)","USA","TTN"]
[null,"Treviso","Italy","TSF"]
[null,"Tri-Cities Regional (TN) /VA","USA","TRI"]
[null,"Trieste","Italy","TRS"]
[null,"Tripoli - Tripoli International","Libya","TIP"]
[null,"Tromsoe","Norway","TOS"]
[null,"Trondheim","Norway","TRD"]
[null,"Tsumeb","Namibia","TSB"]
[null,"Tucson (AZ)","USA","TUS"]
[null,"Tulepo (MS)","USA","TUP"]
[null,"Tulsa (OK)","USA","TUL"]
[null,"Tunis - Carthage","Tunisia","TUN"]
[null,"Turbat","Pakistan","TUK"]
[null,"Turin","Italy","TRN"]
[null,"Turku","Finland","TKU"]
[null,"Tuscaloosa (AL)","USA","TCL"]
[null,"Tuxtla Gutierrez","Mexico","TGZ"]
[null,"Twin Falls (ID)","USA","TWF"]
[null,"Tyler (TX)","USA","TYR"]
[]
[null,"U"]
[null,"Ua Huka","French Polynesia","UAH"]
[null,"Ua Pou","French Polynesia","UAP"]
[null,"Ube","Japan","UBJ"]
[null,"Uberaba","Brazil","UBA"]
[null,"Uberlandia - Eduardo Gomes Airport","Brazil","UDI"]
[null,"Ubon Ratchathani - Muang Ubon Airport","Thailand","UBP"]
[null,"Udaipur - Dabok Airport","India","UDR"]
[null,"Uden - Volkel Airport","Netherlands","UDE"]
[null,"Udon Thani","Thailand","UTH"]
[null,"Ufa","Russia","UFA"]
[null,"Uherske Hradiste","Czech Republic","UHE"]
[null,"Uige","Angola","UGO"]
[null,"Ujung Pandang - Hasanudin Airport","Indonesia","UPG"]
[null,"Ukhta","Russia","UCT"]
[null,"Ukiah (CA)","USA","UKI"]
[null,"Ulaanbaatar - Buyant Uhaa Airport","Mongolia","ULN"]
[null,"Ulan-Ude","Russia","UUD"]
[null,"Ulanhot","PR China","HLH"]
[null,"Ulei","Vanuatu","ULB"]
[null,"Ulsan","South Korea","USN"]
[null,"Ulundi","South Africa","ULD"]
[null,"Umea","Sweden","UME"]
[null,"Umiujaq","Canada","YUD"]
[null,"Umtata","South Africa","UTT"]
[null,"Unalakleet (AK)","USA","UNK"]
[null,"Union Island","Saint Vincent and the Grenadines","UNI"]
[null,"Unst (Shetland Island) - Baltasound Airport","United Kingdom","UNT"]
[null,"Upala","Costa Rica","UPL"]
[null,"Upernavik - Upernavik Heliport","Greenland","JUV"]
[null,"Upington","South Africa","UTN"]
[null,"Upolu Point (HI)","USA","UPP"]
[null,"Uranium City","Canada","YBE"]
[null,"Urgench","Uzbekistan","UGC"]
[null,"Uriman","Venezuela","URM"]
[null,"Urmiehm (Orumieh)","Iran","OMH"]
[null,"Uruapan","Mexico","UPN"]
[null,"Urubupunga - Ernesto Pochler Airport","Brazil","URB"]
[null,"Uruguaiana - Ruben Berta Airport","Brazil","URG"]
[null,"Urumqi","Xinjiang, PR China","URC"]
[null,"Uruzgan","Afghanistan","URZ"]
[null,"Ushuaia - Islas Malvinas Airport","Argentina","USH"]
[null,"Utapao (Pattaya)","Thailand","UTP"]
[null,"Utica (NY) - Oneida County Airport","USA","UCA"]
[null,"Utila","Honduras","UII"]
[null,"Uummannaq","Greenland","UMD"]
[null,"Uzhgorod","Ukraine","UDJ"]
[]
[null,"V"]
[null,"Vaasa","Finland","VAA"]
[null,"Vaexjoe","Sweden","VXO"]
[null,"Vail (CO)","USA","EGE"]
[null,"Val d'Or","Canada","YVO"]
[null,"Valdez (AK)","USA","VDZ"]
[null,"Valdosta (GA)","USA","VLD"]
[null,"Valencia","Spain","VLC"]
[null,"Valencia","Venezuela","VLN"]
[null,"Valladolid","Spain","VLL"]
[null,"Valparaiso","Chile","VAP"]
[null,"Valverde","Spain","VDE"]
[null,"Van - Ferit Melen","Turkey","VAN"]
[null,"Vancouver - Vancouver International","Canada","YVR"]
[null,"Varadero","Cuba","VRA"]
[null,"Varanasi","India","VNS"]
[null,"Varkaus","Finland","VRK"]
[null,"Varna","Bulgaria","VAR"]
[null,"Vasteras","Sweden","VST"]
[null,"Velikiye Luki (Welikije Luki)","Russia","VLU"]
[null,"Venice - Marco Polo","Italy","VCE"]
[null,"Veracruz","Mexico","VER"]
[null,"Vernal (UT)","USA","VEL"]
[null,"Vero Beach/Ft. Pierce (FL)","USA","VRB"]
[null,"Verona (Brescia) Montichiari","Italy","VBS"]
[null,"Verona","Italy","VRN"]
[null,"Victoria","Canada","YYJ"]
[null,"Victoria Falls","Zimbabwe","VFA"]
[null,"Vidin","Bulgaria","VID"]
[null,"Vientiane - Wattay","Lao PDR","VTE"]
[null,"Vigo","Spain","VGO"]
[null,"Villahermosa","Mexico","VSA"]
[null,"Vilnius","Lithuania","VNO"]
[null,"Virgin Gorda","Virgin Islands (British)","VIJ"]
[null,"Visalia (CA)","USA","VIS"]
[null,"Visby","Sweden","VBY"]
[null,"Vitoria","Spain","VIT"]
[null,"Vitoria - Eurico de Aguiar Salles Airport","Brazil","VIX"]
[null,"Vryheid","South Africa","VYD"]
[]
[]
[null,"To travel is to discover that everyone is wrong about other countries"]
[null,"Aldous Huxley"]
[]
[]
[]
[null,"W"]
[null,"Wabush","Canada","YWK"]
[null,"Waco (TX)","USA","ACT"]
[null,"Wagga","Australia","WGA"]
[null,"Walla Walla (WA)","USA","ALW"]
[null,"Wallis","Wallis and Futuna Islands","WLS"]
[null,"Walvis Bay","South Africa","WVB"]
[null,"Warrnambool","Australia","WMB"]
[null,"Warsaw - Frédéric Chopin","Poland","WAW"]
[null,"Washington DC - Baltimore Washington International","USA","BWI"]
[null,"Washington DC - Dulles International","USA","IAD"]
[null,"Washington DC - Ronald Reagan National","USA","DCA"]
[null,"Washington DC","USA","WAS"]
[null,"Waterloo IA","USA","ALO"]
[null,"Watertown (SD)","USA","ATY"]
[null,"Wausau/Stevens Point (WI)","USA","CWA"]
[null,"Weipa","Australia","WEI"]
[null,"Welkom","South Africa","WEL"]
[null,"Wellington","New Zealand","WLG"]
[null,"Wenatchee (WA)","USA","EAT"]
[null,"West Palm Beach (FL)","USA","PBI"]
[null,"West Yellowstone (MT)","USA","WYS"]
[null,"Westerland, Sylt Airport","Germany","GWT"]
[null,"Whakatane","New Zealand","WHK"]
[null,"Whale Cove, NT","Canada","YXN"]
[null,"Whangarei","New Zealand","WRE"]
[null,"White Plains (NY)","USA","HPN"]
[null,"Whitehorse","Canada","YXY"]
[null,"Whitsunday Resort","Australia","HAP"]
[null,"Whyalla","Australia","WYA"]
[null,"Wichita Falls (TX)","USA","SPS"]
[null,"Wichita (KS)","USA","ICT"]
[null,"Wick","United Kingdom","WIC"]
[null,"Wickham","Australia","WHM"]
[null,"Wien (Vienna) - Vienna International","Austria","VIE"]
[null,"Wiesbaden, Air Base","Germany","WIE"]
[null,"Wilkes Barre/Scranton (PA)","USA","AVP"]
[null,"Williamsport (PA)","USA","IPT"]
[null,"Williston (ND)","USA","ISL"]
[null,"Wilmington (NC)","USA","ILM"]
[null,"Wilna (Vilnius)","Lithuania","VNO"]
[null,"Wiluna","Australia","WUN"]
[null,"Windhoek - Eros","Namibia","ERS"]
[null,"Windhoek - Hosea Kutako International","Namibia","WDH"]
[null,"Windsor Ontario","Canada","YQG"]
[null,"Winnipeg International","Canada","YWG"]
[null,"Wolf Point (MT)","USA","OLF"]
[null,"Wollongong","Australia","WOL"]
[null,"Woomera","Australia","UMR"]
[null,"Worcester (MA)","USA","ORH"]
[null,"Worland (WY)","USA","WRL"]
[null,"Wrangell (AK)","USA","WRG"]
[null,"Wuhan","Hubei, PR China","WUH"]
[null,"Wyndham","Australia","WYN"]
[]
[null,"XYZ"]
[null,"Xiamen","Fujian, PR China","XMN"]
[null,"Xi'an - Xianyang","Shaanxi, PR China","XIY"]
[null,"Yakima (WA)","USA","YKM"]
[null,"Yakutat (AK)","USA","YAK"]
[null,"Yakutsk","Russia","YKS"]
[null,"Yamagata, Junmachi","Japan","GAJ"]
[null,"Yamoussoukro","Côte d'Ivoire","ASK"]
[null,"Yanbu","Saudi Arabia","YNB"]
[null,"Yangon (Rangoon) - Mingaladon","Myanmar","RGN"]
[null,"Yaounde","Cameroon","NSI"]
[null,"Yellowknife","Canada","YZF"]
[null,"Yekaterinburg - Koltsovo Airport","Russia","SVX"]
[null,"Yichang","Hubei, PR China","YIH"]
[null,"Yokohama","Japan","YOK"]
[null,"Yuma (AZ)","USA","YUM"]
[null,"Zacatecas","Mexico","ZCL"]
[null,"Zadar","Croatia (Hrvatska)","ZAD"]
[null,"Zagreb - Zagreb Airport Pleso","Croatia (Hrvatska)","ZAG"]
[null,"Zakynthos","Greece","ZTH"]
[null,"Zanzibar","Tanzania","ZNZ"]
[null,"Zaragoza","Spain","ZAZ"]
[null,"Zhob","Pakistan","PZH"]
[null,"Zinder","Niger","ZND"]
[null,"Zouerate","Mauritania","OUZ"]
[null,"Zurich (Zürich) - Kloten","Switzerland","ZRH"]